##TITLE=pulse: SURBOP180_BW24kHz_RF15kHz_pm5_tp333u_2.bruker
offset profile with 0. order phase correction
##JCAMPDX= 6.0         $$ Bruker NMR JCAMP-DX V2.0
##DATA TYPE= NMR SPECTRUM
##DATA CLASS= NTUPLES
##ORIGIN= Bruker BioSpin GmbH
##OWNER= yi8790
##LONG DATE= 2021/07/22 08:18:09+0000
$$ 1.115 TopSpin 4.1.1
$$ 2022-08-04 07:27:09.673 +0200  KIT\yi8790@IBG-4-bulu4
$$ Compression mode = diff/dup
##.OBSERVE FREQUENCY= 400.251881175
##.OBSERVE NUCLEUS= ^1H
##.ACQUISITION MODE= SIMULTANEOUS (DQD)
##.ACQUISITION SCHEME= undefined
##.AVERAGES= 1
##.DIGITISER RES= 22
##SPECTROMETER/DATA SYSTEM= spect
##.PULSE SEQUENCE= selse2d_fq.2.t1.be
##.SOLVENT NAME= H2O+D2O
##.SHIFT REFERENCE= INTERNAL, H2O+D2O, 1, 12.20733
##AUDIT TRAIL= $$ (NUMBER, WHEN, WHO, WHERE, PROCESS, VERSION, WHAT)
$$ ##TITLE= Audit trail, TopSpin 4.1.1
$$ ##JCAMPDX= 5.01
$$ ##ORIGIN= Bruker BioSpin GmbH
$$ ##OWNER= yi8790
$$ $$ C:/Bruker/TopSpin4.1.1/examdata/20210722_SURBOP/22/pdata/999/auditp.txt
$$ ##AUDIT TRAIL=  $$ (NUMBER, WHEN, WHO, WHERE, PROCESS, VERSION, WHAT)
(   1,<2021-07-26 18:43:12.413 +0200>,<KIT\yi8790>,<IBG-4-bulu4>,<mvrow>,<TopSpin 4.1.1>,
      <rsr 1 from
       1 22 "20210722_SURBOP" "C:/Bruker/TopSpin4.1.1/examdata"
       data hash MD5: 64K
       11 A0 A4 84 C2 10 B2 44 2C 5E FA 9F E0 6E B6 D8>)
(   2,<2021-07-26 18:43:12.585 +0200>,<KIT\yi8790>,<IBG-4-bulu4>,<proc1d>,<TopSpin 4.1.1>,
      <zf 
       data hash MD5: 440764
       52 55 A0 67 62 B8 C9 AA C8 65 5A E6 12 64 97 12>)
(   3,<2021-07-26 18:45:03.304 +0200>,<KIT\yi8790>,<IBG-4-bulu4>,<convto1d>,<TopSpin 4.1.1>,
      <created by convto1d from 101 rows of PROCNO 1
       using 4364 points per row between 5.2 and 4.2 ppm
       maximum intensity found at row 45
       data hash MD5: 440764
       D2 EC 72 44 A2 18 62 1B 63 1C 04 00 35 1B AC 73>)
(   4,<2022-01-14 13:43:47.938 +0100>,<KIT\yi8790>,<IBG-4-bulu4>,<audit>,<TopSpin 4.1.1>,
      <user comment:
       TITLE=SURBOP180_BW24kHz_RF15kHz_pm5_tp333u_2.brukerTITLE_END
       data hash MD5: 440764
       D2 EC 72 44 A2 18 62 1B 63 1C 04 00 35 1B AC 73>)
(   5,<2022-08-04 07:04:20.843 +0200>,<KIT\yi8790>,<IBG-4-bulu4>,<audit>,<TopSpin 4.1.1>,
      <user comment:
       TITLE=pulse: SURBOP180_BW24kHz_RF15kHz_pm5_tp333u_2.bruker
       offset profile with 0. order phase correctionTITLE_END
       data hash MD5: 440764
       D2 EC 72 44 A2 18 62 1B 63 1C 04 00 35 1B AC 73>)
(   6,<2022-08-04 07:04:23.239 +0200>,<KIT\yi8790>,<IBG-4-bulu4>,<audit>,<TopSpin 4.1.1>,
      <user comment:
       TITLE=pulse: SURBOP180_BW24kHz_RF15kHz_pm5_tp333u_2.bruker
       offset profile with 0. order phase correctionTITLE_END
       data hash MD5: 440764
       D2 EC 72 44 A2 18 62 1B 63 1C 04 00 35 1B AC 73>)
$$ ##END=
$$ 
$$ $$ hash MD5
$$ $$ 39 94 72 B2 4E 7B D6 82 8F 24 FE 34 9B 79 4C 57
##$RELAX= 
##$RELAX= 
##$RELAX= 
##$RELAX= 
##$RELAX= 
##$RELAX= 
##$RELAX= 
##$RELAX= 
##$RELAX= 
$$ Bruker specific parameters
$$ --------------------------
$$ [...]
##$VALIST= <>
##$VCLIST= <>
##$VDLIST= <>
##$VPLIST= <>
##$VTLIST= <>
##$WBST= 1024
##$WBSW= (0..7)
4 10 10 10 10 10 10 10
##$XGAIN= (0..3)
0 0 0 0
##$XL= 0
##$YL= 0
##$YMAX_a= 243683
##$YMIN_a= -396365
##$ZGOPTNS= <>
##$ZL1= 120
##$ZL2= 120
##$ZL3= 120
##$ZL4= 120
##$scaledByNS= no
##$scaledByRG= no
##$shimCoilTempK= 300
##$ABSF1= 0
##$ABSF2= 0
##$ABSG= 0
##$ABSL= 0
##$ALPHA= 0
##$AQORDER= 0
##$ASSFAC= 0
##$ASSFACI= 0
##$ASSFACX= 0
##$ASSWID= 0
##$AUNMP= <proc_1d>
##$AXLEFT= 0
##$AXNAME= <F2>
##$AXNUC= <1H>
##$AXRIGHT= 0
##$AXTYPE= 0
##$AXUNIT= <>
##$AZFE= 0.1
##$AZFW= 0.1
##$BCFW= 0
##$BC_mod= 0
##$BYTORDP= 0
##$COROFFS= 0
##$CY= 15
##$DATMOD= 1
##$DC= 0
##$DFILT= <>
##$DTYPP= 0
##$ERETIC= no
##$F1P= 0
##$F2P= 0
##$FCOR= 1
##$FTSIZE= 65536
##$FT_mod= 6
##$GAMMA= 0
##$GB= 0
##$INTBC= 1
##$INTSCL= 1
##$ISEN= 128
##$LB= 0.3
##$LEV0= 0
##$LPBIN= 0
##$MAXI= 10000
##$MC2= 0
##$MEAN= 0
##$ME_mod= 0
##$MI= 0
##$MddCEXP= no
##$MddCT_SP= no
##$MddF180= no
##$MddLAMBDA= 0
##$MddMEMORY= 0
##$MddMERGE= 0
##$MddNCOMP= 0
##$MddNITER= 0
##$MddNOISE= 0
##$MddPHASE= 0
##$MddSEED= 0
##$MddSRSIZE= 0
##$Mdd_CsALG= 0
##$Mdd_CsLAMBDA= 0
##$Mdd_CsNITER= 0
##$Mdd_CsNORM= 0
##$Mdd_CsVE= no
##$Mdd_CsZF= 0
##$Mdd_LrLAMBDA= 0
##$Mdd_LrNITER= 0
##$Mdd_LrRANK= 0
##$Mdd_LrZF= 0
##$Mdd_mod= 0
##$NCOEF= 0
##$NC_proc= -8
##$NLEV= 6
##$NOISF1= 0
##$NOISF2= 0
##$NSP= 0
##$NTH_PI= 0
##$NZP= 0
##$OFFSET= 12.20733
##$PC= 1
##$PHC0= -77.925
##$PHC1= 0
##$PH_mod= 1
##$PKNL= yes
##$PPARMOD= 0
##$PPDIAG= 0
##$PPIPTYP= 0
##$PPMPNUM= 2147483647
##$PPRESOL= 1
##$PSCAL= 4
##$PSIGN= 0
##$PYNMP= <proc.py>
##$RDF1= 0
##$RDF2= 0
##$RDFWHM= 0
##$RDINT= 0
##$RDPOS= 0
##$REVERSE= no
##$SF= 400.25
##$SI= 440764
##$SIGF1= 0
##$SIGF2= 0
##$SINO= 0
##$SIOLD= 440764
##$SPECTYP= <>
##$SREF_mod= 1
##$SREGLST= <1H.CDCl3>
##$SSB= 0
##$STSI= 440764
##$STSR= 0
##$SW_p= 6009.61538461539
##$SYMM= 0
##$S_DEV= 1727
##$TDeff= 16384
##$TDoff= 0
##$TI= <>
##$TILT= no
##$TM1= 0
##$TM2= 0
##$TOPLEV= 0
##$USERP1= <>
##$USERP2= <>
##$USERP3= <>
##$USERP4= <>
##$USERP5= <>
##$WDW= 1
##$XDIM= 440764
##$YMAX_p= 453859651
##$YMIN_p= -21348289
##$CURPLOT= < !		Ô!		à!		>
##$CURPRIN= <$1#1#0#1#1#1#1#1#0#-1#-1#1#-1>
##$DFORMAT= <normdp>
##$LAYOUT= <+/1D_H.xwp>
##$LFORMAT= <normlp>
##$PFORMAT= <normpl>
$$ End of Bruker specific parameters
$$ ---------------------------------
##NTUPLES= NMR SPECTRUM
##VAR_NAME=  FREQUENCY,     SPECTRUM/REAL,   SPECTRUM/IMAG
##SYMBOL=    X,             R,               I
##VAR_TYPE=  INDEPENDENT,   DEPENDENT,       DEPENDENT
##VAR_FORM=  AFFN,          ASDF,            ASDF
##VAR_DIM=   440764,        440764,          440764
##UNITS=     HZ,            ARBITRARY UNITS, ARBITRARY UNITS
##FACTOR=    0.0136345422598383, 1,          1
##FIRST=     6009.60175007313, -1117,        685
##LAST=      0,             5839,            -1344
##MIN=       0,             -21348289,       0
##MAX=       6009.60175007313, 453859651,    0
$$ Real data points
##PAGE= N=1
##DATA TABLE= (X++(R..R)), XYDATA
$$ [...]
256835g1333M83M89M56L41J21j79m71o28n65k67J60N46P17N92K26k16n20n38k60
$$ -71333 -70850 -70361 -69905 -69564 -69443 -69622 -70093 -70721 -71286 -71553 -71393 -70847 -70130 -69538 -69312 -69528 -70048 -70586 -70846
256816g0846J85N84P57O37L09n1k58k34m4J43J50r9n23r10j023p26p1P13J312
$$ -70846 -70661 -70077 -69320 -68683 -68374 -68425 -68683 -68917 -68961 -68818 -68668 -68767 -69290 -70200 -71223 -71949 -72020 -71307 -69995
256797f9995J475J130M27l37q48r20n71nN02P29O16K75p9k53j70J03L81M85L16
$$ -69995 -68520 -67390 -66963 -67300 -68148 -69068 -69639 -69644 -69142 -68413 -67797 -67522 -67601 -67854 -68024 -67921 -67540 -67055 -66739
256778f6739p7n36q62r21o93k82J48M40N15L88J45j09k92l69l59k92k10j37r7
$$ -66739 -66816 -67352 -68214 -69135 -69828 -70110 -69962 -69522 -69007 -68619 -68474 -68583 -68875 -69244 -69603 -69895 -70105 -70242 -70339
256759g0339j07j70k81l89m37l55j22K12N27O72N41J27m36r33j143r50m14K50
$$ -70339 -70446 -70616 -70897 -71286 -71723 -72078 -72200 -71988 -71461 -70789 -70248 -70121 -70557 -71490 -72633 -73583 -73997 -73747
256741g3747P55Q80N68k1n91q48o32j6P36J272J335Q72P0p43j234j243q23k35
$$ -73747 -72992 -72112 -71544 -71565 -72156 -73004 -73636 -73652 -72916 -71644 -70309 -69437 -69367 -70110 -71344 -72587 -73410 -73645
256723g3645K18L19N7l85p22p22l29L09R08J184R88L87l86j019j277j095n88O
$$ -73645 -73427 -73108 -73051 -73436 -74158 -74880 -75209 -74900 -73992 -72808 -71820 -71433 -71819 -72838 -74115 -75210 -75798 -75792
256705g5792M49O07M85K09n7j96j87q8NK5k7r3j04j9J31K68L05K00j6k46l68l15
$$ -75792 -75343 -74736 -74251 -74042 -74099 -74295 -74482 -74570 -74565 -74540 -74567 -74660 -74764 -74783 -74652 -74384 -74079 -73879 -73895 -74141 -74509 -74824
256683g4824r1K14M72N68M64K05j04l48m50m16l05k14k15l31n34p55r24r88r28
$$ -74824 -74915 -74701 -74229 -73661 -73197 -72992 -73096 -73444 -73894 -74310 -74615 -74829 -75044 -75375 -75909 -76664 -77588 -78576 -79504
256664g9504p48m58r4L10O85R50J013Q23L98j56o62r25q23l54L48J041J477J500
$$ -79504 -80252 -80710 -80804 -80494 -79809 -78859 -77846 -77023 -76625 -76781 -77443 -78368 -79191 -79545 -79197 -78156 -76679 -75179
256646g5179J108M56k04o34p04m43j1L71N34M22J15k21m20l87j33K36O00Q62J008
$$ -75179 -74071 -73615 -73819 -74453 -75157 -75600 -75611 -75240 -74706 -74284 -74169 -74390 -74810 -75197 -75330 -75094 -74494 -73632 -72624
256627g2624J076J125J179J202J121Q72M56m4m73o84o03k64J89N74P48O75M34
$$ -72624 -71548 -70423 -69244 -68042 -66921 -66049 -65593 -65637 -66110 -66794 -67397 -67661 -67472 -66898 -66150 -65475 -65041
256610f5041J70K5N5K10L70M02K52m1l50n36n12k96J1K79M22M40M12M47O02Q45
$$ -65041 -64871 -64846 -64791 -64581 -64211 -63809 -63557 -63598 -63948 -64484 -64996 -65292 -65281 -65002 -64580 -64140 -63728 -63281 -62679 -61834
256590f1834J052J082Q41L54k44p51j004r40o32k37Q5K42K63K49L14N03P51R19
$$ -61834 -60782 -59700 -58859 -58505 -58749 -59500 -60504 -61444 -62076 -62313 -62228 -61986 -61723 -61474 -61160 -60657 -59906 -58987
256572e8987Q72N48L4m94q17q01m44J13O54R86J019P95M38R0j63l10l93m53m75
$$ -58987 -58115 -57567 -57533 -58027 -58844 -59645 -60089 -59976 -59322 -58336 -57317 -56522 -56084 -55994 -56157 -56467 -56860 -57313 -57788
256553e7788l97j50K76P94J232J406J217P19J01l72n12k84J58N43O32L25k58q43
$$ -57788 -58185 -58335 -58059 -57265 -56033 -54627 -53410 -52691 -52590 -52962 -53474 -53758 -53600 -53057 -52425 -52100 -52358 -53201
256535e3201j134r63l87L34Q62R55N79n9o25q16n24J14P79J132R81L80l99j004
$$ -53201 -54335 -55298 -55685 -55351 -54489 -53534 -52955 -53014 -53639 -54455 -54979 -54865 -54086 -52954 -51973 -51593 -51992 -52996
256517e2996j166q32j80M76Q42P85L81j37n04n62l13Q0M10N29M17J83j2n0Q0K82
$$ -52996 -54162 -54994 -55174 -54698 -53856 -53071 -52690 -52827 -53331 -53893 -54206 -54126 -53716 -53187 -52770 -52587 -52599 -52649 -52569 -52287
256497e2287M05L44Q5k82o07p68p22n14k56n3M6N5L4K5L7K8n0k11m08n49n38l43
$$ -52287 -51882 -51538 -51453 -51735 -52342 -53110 -53832 -54346 -54602 -54655 -54609 -54554 -54520 -54495 -54458 -54430 -54480 -54691 -55099 -55648 -56186 -56529
256475e6529k3K88M41L53M9l31n96o01l07J85O90J010J040P98M17O9j06p0J13
$$ -56529 -56552 -56264 -55823 -55470 -55421 -55752 -56348 -56949 -57256 -57071 -56381 -55371 -54331 -53533 -53116 -53047 -53153 -53223 -53110
256456e3110L25M59M73L97L11K76L06L54L38K06k9k76m07l13M2N95J197J684J933
$$ -53110 -52785 -52326 -51853 -51456 -51145 -50869 -50563 -50209 -49871 -49665 -49694 -49970 -50377 -50690 -50648 -50053 -48856 -47172 -45239
256437d5239J902J645J272Q98O06M13K97K09J24L6k6l3K2J20K11K40J66j0k48
$$ -45239 -43337 -41692 -40420 -39522 -38916 -38503 -38206 -37997 -37873 -37837 -37863 -37896 -37874 -37754 -37543 -37303 -37137 -37147 -37395
256418c7395m71n92n44k95J25O37J122J461J552J366R37L70j94o30q54q56o96
$$ -37395 -37866 -38458 -39002 -39297 -39172 -38535 -37413 -35952 -34400 -33034 -32097 -31727 -31921 -32551 -33405 -34261 -34957
256401c4957m72k76j65j44j72k05k07j87j75k03k87l85m46l97k14P8L96O27O78
$$ -34957 -35429 -35705 -35870 -36014 -36186 -36391 -36598 -36785 -36960 -37163 -37450 -37835 -38281 -38678 -38892 -38814 -38418 -37791 -37113
256382c7113N16J70k62o60r29j020r38p42m94k53n2J08K35L43M43N41O34P21P92
$$ -37113 -36597 -36427 -36689 -37349 -38278 -39298 -40236 -40978 -41472 -41725 -41777 -41669 -41434 -41091 -40648 -40107 -39473 -38752 -37960
256363c7960Q28P93O55L99L8l68p23r31r21o84k83J61N25P17P24O02M61M02M79
$$ -37960 -37132 -36339 -35684 -35285 -35247 -35615 -36338 -37269 -38190 -38874 -39157 -38996 -38471 -37754 -37030 -36428 -35967 -35565 -35086
256344c5086O63Q60R52Q50N43J07l11n61n39k33K66Q12J250J478J485J341J159
$$ -35086 -34423 -33563 -32611 -31761 -31218 -31111 -31422 -31983 -32522 -32755 -32489 -31677 -30427 -28949 -27464 -26123 -24964
256327b4964J054J076J221J422J606J716J754J761J787J864J973K056K046a723
$$ -24964 -23910 -22834 -21613 -20191 -18585 -16869 -15115 -13354 -11567 -9703 -7730 -5674 -3628 -1723
256312f2A336J234J248J460J796K128K329K335K180J985J905K049K424K930L391
$$ -62 1336 2570 3818 5278 7074 9202 11531 13866 16046 18031 19936 21985 24409 27339 30730
256297C0730L637L575L232K739K269J966J867J920K000J988J829J571J317J193
$$ 30730 34367 37942 41174 43913 46182 48148 50015 51935 53935 55923 57752 59323 60640 61833
256283F1833J265J513J830K078K142J988J672J314J054R84J131J435J791K074
$$ 61833 63098 64611 66441 68519 70661 72649 74321 75635 76689 77673 78804 80239 82030 84104
256269H4104K185K073J746J268P41K88J9KK32O27J043J325J356J112O70J87j73
$$ 84104 86289 88362 90108 91376 92117 92405 92424 92426 92658 93285 94328 95653 97009 98121 98791 98978 98805
256252I8805k97j85O3K94L79K70L5j91k70j36J56M68O31N38J96k70o72q49p40
$$ 98805 98508 98323 98386 98680 99059 99329 99364 99173 98903 98767 98923 99391 100022 100560 100756 100486 99814 98965 98225
256233I8225l92N4M46O97Q09Q59R48J127J364J568J625J475J145P47M25K97L95
$$ 98225 97833 97887 98333 99030 99839 100698 101646 102773 104137 105705 107330 108805 109950 110697 111122 111419 111814
256216A11814O62R89J256J391J384J273J110R27P29N09K70M7j09j49o3J02K59
$$ 111814 112476 113465 114721 116112 117496 118769 119879 120806 121535 122044 122314 122361 122252 122103 122040 122142 122401
256199A22401L23K49P1j20k10j22J31M69P57Q79P89N29K04o5j93j61j1J91L81
$$ 122401 122724 122973 123044 122924 122714 122592 122723 123192 123949 124828 125617 126146 126350 126285 126092 125931 125920 126111 126492
256180A26492N32O32O79O64N57L43M5k66m76m90k66J39N84R03R72P87M61J83J20
$$ 126492 127024 127656 128335 128999 129556 129899 129944 129678 129202 128712 128446 128585 129169 130072 131044 131831 132292 132475 132595
256161A32595L52P98J263J519J402Q99J56n76j043j091p24q3O10J144J400J367
$$ 132595 132947 133745 135008 136527 137929 138828 138984 138408 137365 136274 135550 135467 136077 137221 138621 139988
256145A39988J134Q29N69M24M09M99O53Q23R69J047J029Q94O69M15K23J91L76
$$ 139988 141122 141951 142520 142944 143353 143852 144505 145328 146297 147344 148373 149267 149936 150351 150574 150765 151141
256128A51141P61J252J706J969J939J596J016L35k90p29r10q32n48j46K74O25
$$ 151141 151902 153154 154860 156829 158768 160364 161380 161715 161425 160696 159786 158954 158406 158260 158534 159159
256112A59159Q39Q79P45M75J36j85m16n03m34k26P2M09P42J036J265J396J406
$$ 159159 159998 160877 161622 162097 162233 162048 161632 161129 160695 160469 160541 160950 161692 162728 163993 165389 166795
256095A66795J279J020O76L21M4q7n5J07L19M89N59N18M05K92K36K75L94N65P51
$$ 166795 168074 169094 169770 170091 170135 170048 169993 170100 170419 170908 171467 171985 172390 172682 172918 173193 173587 174152 174903
256076A74903R28J092J234J344J392J348J210J016Q48Q01R40J251J634J941K029
$$ 174903 175831 176923 178157 179501 180893 182241 183451 184467 185315 186116 187056 188307 189941 191882 193911
256061A93911J833J412R13N36M17N83R37J293J489J447J228R98R30J131J567K064
$$ 193911 195744 197156 198069 198605 199022 199605 200542 201835 203324 204771 205999 206997 207927 209058 210625 212689
256045B12689K395K374J956J255N09j2j34J77P82J450J938K086J862J370P87L04
$$ 212689 215084 217458 219414 220669 221178 221166 221032 221209 221991 223441 225379 227465 229327 230697 231484 231788
256029B31788O3J17M32R03J397J782J965J911J646J246Q23M73K60K01K52L67M94
$$ 231788 231851 231968 232400 233303 234700 236482 238447 240358 242004 243250 244073 244546 244806 245007 245259 245626 246120
256012B46120O29P95J026J328J652J899J961J767J342Q07L41J13K03N64J040J435
$$ 246120 246749 247544 248570 249898 251550 253449 255410 257177 258519 259326 259667 259780 259983 260547 261587 263022
255996B63022J601J510J250R90Q77R67J189J386J399J154P12K52pQ0N26J181J813
$$ 263022 264623 266133 267383 268373 269250 270217 271406 272792 274191 275345 276057 276309 276302 276382 276908 278089 279902
255979B79902K181K161J777J195O39L06K90N57R84J413J725J873J872J790J687
$$ 279902 282083 284244 286021 287216 287855 288161 288451 289008 289992 291405 293130 295003 296875 298665 300352
255964C00352J613J579J588J633J716J838J988K138K250K287K236K119J988J906
$$ 300352 301965 303544 305132 306765 308481 310319 312307 314445 316695 318982 321218 323337 325325 327231
255950C27231J918K035K224K415K539K534K391K142J856J624J525J611J879K279
$$ 327231 329149 331184 333408 335823 338362 340896 343287 345429 347285 348909 350434 352045 353924 356203
255936C56203K720L088L282L255L015K639K239J926J775J789J923K087K211K258
$$ 356203 358923 362011 365293 368548 371563 374202 376441 378367 380142 381931 383854 385941 388152 390410
255922C90410K244K223K246K322K422K465K380K128J735J289R01O63O16P23Q98
$$ 390410 392654 394877 397123 399445 401867 404332 406712 408840 410575 411864 412765 413428 414044 414767 415665
255907D15665J036J051R15O57L49Q3o1l8J53M67Q19J112J250J178R02M94P5k23
$$ 415665 416701 417752 418667 419324 419673 419756 419695 419657 419810 420277 421096 422208 423458 424636 425538 426032 426107 425884
255889D25884l17k03L3K50L15J67j48m92o98o47l33J30N59P83P29M45R1j58j79
$$ 425884 425567 425364 425397 425647 425962 426129 425981 425489 424791 424144 423811 423941 424500 425283 426012 426457 426548 426390 426211
255870D26211K5L44O22P41O72M98L54L44M93P24R11R52Q31O43N32O22R34J363
$$ 426211 426236 426580 427202 427943 428615 429113 429467 429811 430304 431028 431939 432891 433722 434365 434897 435519 436453 437816
255852D37816J722J831J601J094M85qk26j34J78N47Q24R38R09Q16P31O71N92M38
$$ 437816 439538 441369 442970 444064 444549 444541 444315 444181 444359 444906 445730 446668 447577 448393 449124 449795 450387 450825
255834D50825J75j48m27n48m48j74J36L16K44q3n55r99j267j311j203j083j087
$$ 450825 451000 450852 450425 449877 449429 449255 449391 449707 449951 449868 449313 448314 447047 445736 444533 443450 442363
255817D42363j261j542j792j887j785j571j404j448j765k291k851l244l355l204
$$ 442363 441102 439560 437768 435881 434096 432525 431121 429673 427908 425617 422766 419522 416167 412963
255803D12963k939k763k829l170l676m170m483m551m424m235m121m149m288m448
$$ 412963 410024 407261 404432 401262 397586 393416 388933 384382 379958 375723 371602 367453 363165 358717
255789C58717m533m520m463m471m627m933n290n543n560n303m872m446m211m244
$$ 358717 354184 349664 345201 340730 336103 331170 325880 320337 314777 309474 304602 300156 295945 291701
255775B91701m489m749m811m527l919l166k544k291k519l139l921m577m887m776
$$ 291701 287212 282463 277652 273125 269206 266040 263496 261205 258686 255547 251626 247049 242162 237386
255761B37386m342l783l316l079l089l247l404l433l278k973k615k311k137k113
$$ 237386 233044 229261 225945 222866 219777 216530 213126 209693 206415 203442 200827 198516 196379 194266
255747A94266k202k341k464k532k527k450k302k081j786j423j030o73m41m15o28
$$ 194266 192064 189723 187259 184727 182200 179750 177448 175367 173581 172158 171128 170455 170014 169599 168971
255732A68971j047j554j983k169j997j477p27M0N92P68N35Mo02j054j177r40m47
$$ 168971 167924 166370 164387 162218 160221 158744 158017 158057 158649 159417 159952 159956 159354 158300 157123 156183 155736
255715A55736J12N44P33O84N00L31K91M10O26Q22Q91P85N26K09p3k43k84k14p6
$$ 155736 155848 156392 157125 157809 158309 158640 158931 159341 159967 160789 161680 162465 162991 163200 163127 162884 162600 162386 162310
255696A62310J06L22N68Q31J067J221J250J150R79Q32P99R10J119J314J370J214
$$ 162310 162416 162738 163306 164137 165204 166425 167675 168825 169804 170636 171435 172345 173464 174778 176148 177362
255680A77362Q81M92K15J76M03Q02J200J441J439J240R86Q40R10J187J553J843
$$ 177362 178243 178735 178950 179126 179529 180331 181531 182972 184411 185651 186637 187477 188387 189574 191127 192970
255664A92970J932J795J515J251J141J250J530J854K077K124K001J806J669J688
$$ 192970 194902 196697 198212 199463 200604 201854 203384 205238 207315 209439 211440 213246 214915 216603
255650B16603J888K203K526K740K782K653K412K149J951J878J956K179K507K875
$$ 216603 218491 220694 223220 225960 228742 231395 233807 235956 237907 239785 241741 243920 246427 249302
255636B49302L212L441L514L423L207K950K740K638K655K748K857K936K989L064
$$ 249302 252514 255955 259469 262892 266099 269049 271789 274427 277082 279830 282687 285623 288612 291676
255622B91676L222L483L796M041M089L865L414K903K559K574L001L703M422M862
$$ 291676 294898 298381 302177 306218 310307 314172 317586 320489 323048 325622 328623 332326 336748 341610
255608C41610M840M376L681L079K852L114L757M514N077N248N023M592M233M184
$$ 341610 346450 350826 354507 357586 360438 363552 367309 371823 376900 382148 387171 391763 395996 400180
255594D00180M528N173N889O435O663O567O273N956N762N744N860O028O175O279
$$ 400180 404708 409881 415770 422205 428868 435435 441708 447664 453426 459170 465030 471058 477233 483512
255580D83512O374O511O719O983P253P471P622P727P841Q002Q212Q424Q565Q597
$$ 483512 489886 496397 503116 510099 517352 524823 532445 540172 548013 556015 564227 572651 581216 589813
255566E89813Q537Q476Q532Q803R303R949J0589J1065J1274J1208J0951J0633
$$ 589813 598350 606826 615358 624161 633464 643413 654002 665067 676341 687549 698500 709133
255554G09133J0373J0239J0244J0366J0578J0878J1270J1748J2269J2735J3039
$$ 709133 719506 729745 739989 750355 760933 771811 783081 794829 807098 819833 832872
255543H32872J3092J2882J2492J2080J1818J1832J2155J2710J3355J3934J4335
$$ 832872 845964 858846 871338 883418 895236 907068 919223 931933 945288 959222 973557
255532I73557J4523J4532J4451J4368J4357J4460J4688J5032J5466J5961J6472
$$ 973557 988080 1002612 1017063 1031431 1045788 1060248 1074936 1089968 1105434 1121395 1137867
255521A137867J6957J7394J7773J8116J8459J8836J9253J9691K0107K0473K0778
$$ 1137867 1154824 1172218 1189991 1208107 1226566 1245402 1264655 1284346 1304453 1324926 1345704
255510A345704K1058K1367K1754K2229K2769K3311K3825K4318K4853K5526K6401
$$ 1345704 1366762 1388129 1409883 1432112 1454881 1478192 1502017 1526335 1551188 1576714 1603115
255499A603115K7463K8605K9656L0470L0992L1304L1603L2110L2979L4209L5642
$$ 1603115 1630578 1659183 1688839 1719309 1750301 1781605 1813208 1845318 1878297 1912506 1948148
255488A948148L7036L8186L9007L9590M0153M0932M2067M3533M5156M6698M7975
$$ 1948148 1985184 2023370 2062377 2101967 2142120 2183052 2225119 2268652 2313808 2360506 2408481
255477B408481M8943M9718N0503N1512N2848N4493N6317N8165N9926O1583O3191
$$ 2408481 2457424 2507142 2557645 2609157 2662005 2716498 2772815 2830980 2890906 2952489 3015680
255466C015680O4834O6558O8354P0175P1967P3739P5562P7558P9837Q2450Q5364
$$ 3015680 3080514 3147072 3215426 3285601 3357568 3431307 3506869 3584427 3664264 3746714 3832078
255455C832078Q8476R1659R4817R7916J00973J04038J07152J10336J13588J16924
$$ 3832078 3920554 4012213 4107030 4204946 4305919 4409957 4517109 4627445 4741033 4857957
255445D857957J20374J23993J27838J31933J36248J40714J45253J49826J54451
$$ 4857957 4978331 5102324 5230162 5362095 5498343 5639057 5784310 5934136 6088587
255436F088587J59211J64203J69506J75138J81066J87236J93608K00188K07004
$$ 6088587 6247798 6412001 6581507 6756645 6937711 7124947 7318555 7518743 7725747
255427G725747K14083K21405K28904K36496K44137K51883K59900K68416K77622
$$ 7725747 7939830 8161235 8390139 8626635 8870772 9122655 9382555 9650971 9928593
255418I928593K87593K98233L09314L20574L31839L43103L54528L66363L78809
$$ 9928593 10216186 10514419 10823733 11144307 11476146 11819249 12173777 12540140 12918949
255409A2918949L91943M05679M19834M34252M48888M63869M79420M95768N13031
$$ 12918949 13310892 13716571 14136405 14570657 15019545 15483414 15962834 16458602 16971633
255400A6971633N31171N50028N69429N89288O09674O30780O52836O76004P00316
$$ 16971633 17502804 18052832 18622261 19211549 19821223 20452003 21104839 21780843 22481159
255391B2481159P25683P51978P79120Q07142Q36172Q66365Q97825R30559R64501
$$ 22481159 23206842 23958820 24737940 25545082 26381254 27247619 28145444 29076003 30040504
255382C0040504R99582J035810J073306J112260J152837J195100J238965J284260
$$ 30040504 31040086 32075896 33149202 34261462 35414299 36609399 37848364 39132624
255374C9132624J330836J378683J427968J478983J532016J587204J644453J703499
$$ 39132624 40463460 41842143 43270111 44749094 46281110 47868314 49512767 51216266
255366E1216266J764032J825875J889105J954029K021076K090604K162767K237485
$$ 51216266 52980298 54806173 56695278 58649307 60670383 62760987 64923754 67161239
255358F7161239K314530K393703K474951K558440K644459K733297K825083K919757
$$ 67161239 69475769 71869472 74344423 76902863 79547322 82280619 85105702 88025459
255350H8025459L017120L116959L219168L323784L430923L540649L652862L767276
$$ 88025459 91042579 94159538 97378706 100702490 104133413 107674062 111326924 115094200
255342A15094200L883515M001247M120332M240833M362917M486670M611927M738233
$$ 115094200 118977715 122978962 127099294 131340127 135703044 140189714 144801641 149539874
255334A49539874M864931M991368N117106N242004N366159N489694N612525N734215
$$ 149539874 154404805 159396173 164513279 169755283 175121442 180611136 186223661 191957876
255326A91957876N853994N970920O084095O192827O296635O395120O487772O573830
$$ 191957876 197811870 203782790 209866885 216059712 222356347 228751467 235239239 241813069
255318B41813069O652287O722024O782037O831607O870340O898090O914806O920429
$$ 241813069 248465356 255187380 261969417 268801024 275671364 282569454 289484260 296404689
255310B96404689O914931O898479O871694O835799O792636O744418O693361O641221
$$ 296404689 303319620 310218099 317089793 323925592 330718228 337462646 344156007 350797228
255302C50797228O588929O536337O482095O423639O357218O278019O180414O058400
$$ 350797228 357386157 363922494 370404589 376828228 383185446 389463465 395643879 401702279
255294D01702279N906208N718977N493277N227301M920631M573654M186865L760410
$$ 401702279 407608487 413327464 418820741 424048042 428968673 433542327 437729192 441489602
255286D41489602L294109K788061K243660J664730J058361M35237j90658q02822
$$ 441489602 444783711 447571772 449815432 451480162 452538523 452973760 452783102 451980280
255278D51980280j383364j914263k378800k763173l058308l261734l379133l424995
$$ 451980280 450596916 448682653 446303853 443540680 440482372 437220638 433841505 430416510
255270D30416510l421892l398082l383698l406219l486255l634667l851701m128236
$$ 430416510 426994618 423596536 420212838 416806619 413320364 409685697 405833996 401705760
255262D01705760m448604m794140n146444n489671n811576o103515o359843o577204
$$ 401705760 397257156 392463016 387316572 381826901 376015325 369911810 363551967 356974763
255254C56974763o754032o890333o987573p048517p076875p076784p052293p007011
$$ 356974763 350220731 343330398 336342825 329294308 322217433 315140649 308088356 301081345
255246C01081345o944024o866043o775646o675447o568074o455981o341193o225111
$$ 301081345 294137321 287271278 280495632 273820185 267252111 260796130 254454937 248229826
255238B48229826o108515n991704n874768n757783n640939n524497n408690n293634
$$ 248229826 242121311 236129607 230254839 224497056 218856117 213331620 207922930 202629296
255230B02629296n179319n065701m952823m840901m730313m621514m514876m410590
$$ 202629296 197449977 192384276 187431453 182590552 177860239 173238725 168723849 164313259
255222A64313259m308631m208833m110987m014952l920673l828153l737365l648203
$$ 164313259 160004628 155795795 151684808 147669856 143749183 139921030 136183665 132535462
255214A32535462l560491l474018l388644l304332l221150l139206l058552k979154
$$ 132535462 128974971 125500953 122112309 118807977 115586827 112447621 109389069 106409915
255206A06409915k900886k823602k747226k671805k597507k524551k453121k383304
$$ 106409915 103509029 100685427 97938201 95266396 92668889 90144338 87691217 85307913
255198H5307913k315079k248369k183123k119361k057186j996741j938140j881420
$$ 85307913 82992834 80744465 78561342 76441981 74384795 72388054 70449914 68568494
255190F8568494j826542j773419j721967j672132j623885j577171j531884j487848
$$ 68568494 66741952 64968533 63246566 61574434 59950549 58373378 56841494 55353646
255182E5353646j444870j402817j361683j321592j282756j245364j209472j174962
$$ 55353646 53908776 52505959 51144276 49822684 48539928 47294564 46085092 44910130
255174D4910130j141573j109002j077040j045651j014971r85225r56612r29187
$$ 44910130 43768557 42659555 41582515 40536864 39521893 38536668 37580056 36650869
255166C6650869r02847q77369q52526q28185q04355p81147p58717p37139p16394
$$ 36650869 35748022 34870653 34018127 33189942 32385587 31604440 30845723 30108584 29392190
255157B9392190o96348o76841o57757o39068o20838o03171n86149n69788n54040
$$ 29392190 28695842 28019001 27361244 26722176 26101338 25498167 24912018 24342230 23788190
255148B3788190n38822n24058n09721m95809m82340m69316m56705m44462m32546
$$ 23788190 23249368 22725310 22215589 21719780 21237440 20768124 20311419 19866957 19434411
255139A9434411m20945m09665l98721l88097l77749l67621l57689l47998l38651
$$ 19434411 19013466 18603801 18205080 17816983 17439234 17071613 16713924 16365926 16027275
255130A6027275l29786l21475l13680l06234k98893k91440k83802k76086k68553
$$ 16027275 15697489 15376014 15062334 14756100 14457207 14165767 13881965 13605879 13337326
255121A3337326k61475k55010k49098k43472k37783k31765k25384k18871k12629
$$ 13337326 13075851 12820841 12571743 12328271 12090488 11858723 11633339 11414468 11201839
255112A1201839k07043k02303j98285j94612j90808j86515j81644j76412j71226
$$ 11201839 10994796 10792493 10594208 10399596 10208788 10022273 9840629 9664217 9492991
255103I492991j66488j62416j58960j55845j52719j49329j45626j41764j38002
$$ 9492991 9326503 9164087 9005127 8849282 8696563 8547234 8401608 8259844 8121842
255094H121842j34555j31496j28721j26030j23239j20271j17190j14159j11336
$$ 8121842 7987287 7855791 7727070 7601040 7477801 7357530 7240340 7126181 7014845
255085G014845j08793j06489j04293j02073r9768r7414r5117r2984r1054q9266
$$ 7014845 6906052 6799563 6695270 6593197 6493429 6396015 6300898 6207914 6116860 6027594
255075F027594q7499q5626q3592q1445p9317p7365p5699p4334p3197p2159p1094
$$ 6027594 5940095 5854469 5770877 5689432 5610115 5532750 5457051 5382717 5309520 5237361 5166267
255064E166267o9923o8619o7201o5701o4152o2584o1048n9617n8369n7371n6616
$$ 5166267 5096344 5027725 4960524 4894823 4830671 4768087 4707039 4647422 4589053 4531682 4475066
255053D475066n6021n5433n4675n3638n2306n0787m9265m7919m6859m6073m5462
$$ 4475066 4419045 4363612 4308937 4255299 4202993 4152206 4102941 4055022 4008163 3962090 3916628
255042C916628m4872m4194m3381m2478m1566m0715l9941l9200l8431l7596l6712
$$ 3916628 3871756 3827562 3784181 3741703 3700137 3659422 3619481 3580281 3541850 3504254 3467542
255031C467542l5865l5146l4621l4278l4022l3722l3275l2656l1931l1233l0697
$$ 3467542 3431677 3396531 3361910 3327632 3293610 3259888 3226613 3193957 3162026 3130793 3100096
255020C100096l0392l0283l0257l0149k9824k9232k8411k7476k6567k5802k5239
$$ 3100096 3069704 3039421 3009164 2979015 2949191 2919959 2891548 2864072 2837505 2811703 2786464
255009B786464k4869k4646k4483k4303k4039k3652k3128k2488k1788k1109k0538
$$ 2786464 2761595 2736949 2712466 2688163 2664124 2640472 2617344 2594856 2573068 2551959 2531421
254998B531421k0141j9934j9882j9899j9890j9781j9555j9244j8915j8624j8394
$$ 2531421 2511280 2491346 2471464 2451565 2431675 2411894 2392339 2373095 2354180 2335556 2317162
254987B317162j8196j7973j7673j7286j6852j6448j6160j6029j6042j6132j6209
$$ 2317162 2298966 2280993 2263320 2246034 2229182 2212734 2196574 2180545 2164503 2148371 2132162
254976B132162j6200j6079j5861j5601j5339j5103j4883j4666j4440j4219j4035
$$ 2132162 2115962 2099883 2084022 2068421 2053082 2037979 2023096 2008430 1993990 1979771 1965736
254965A965736j3922j3880j3876j3847j3734j3504j3181j2818j2483j2211j1993
$$ 1965736 1951814 1937934 1924058 1910211 1896477 1882973 1869792 1856974 1844491 1832280 1820287
254954A820287j1778j1514j1188j0851j0603j0550j0750j1163j1663j2069j2225
$$ 1820287 1808509 1796995 1785807 1774956 1764353 1753803 1743053 1731890 1720227 1708158 1695933
254943A695933j2067j1634j1063j0510j0094r843r711r607r471r307r175r164
$$ 1695933 1683866 1672232 1661169 1650659 1640565 1630722 1621011 1611404 1601933 1592626 1583451 1574287
254931A574287r321r611r921j0105j0052r744r268q779q433q302q351q454q456
$$ 1574287 1564966 1555355 1545434 1535329 1525277 1515533 1506265 1497486 1489053 1480751 1472400 1463946 1455490
254918A455490q249p822p275o757o411o316o452o736p059p332p513p605p626p590
$$ 1455490 1447241 1439419 1432144 1425387 1418976 1412660 1406208 1399472 1392413 1385081 1377568 1369963 1362337 1354747
254904A354747p504p376p226p107p075p160p332p495p512p287o801o172n603n331
$$ 1354747 1347243 1339867 1332641 1325534 1318459 1311299 1303967 1296472 1288960 1281673 1274872 1268700 1263097 1257766
254890A257766n494o088o928p735q228q256p845p184o540o123o008o110o241o210
$$ 1257766 1252272 1246184 1239256 1231521 1223293 1215037 1207192 1200008 1193468 1187345 1181337 1175227 1168986 1162776
254876A162776n928n456m973m690m748n151n765o370o760o823o573o124n637n233
$$ 1162776 1156848 1151392 1146419 1141729 1136981 1131830 1126065 1119695 1112935 1106112 1099539 1093415 1087778 1082545
254862A082545m974m840m776m734m698m689m746m881n081n295n457n522n466n302
$$ 1082545 1077571 1072731 1067955 1063221 1058523 1053834 1049088 1044207 1039126 1033831 1028374 1022852 1017386 1012084
254848A012084n060m777m486m217m008l898l919m076m332m603m787m800m614m272
$$ 1012084 1007024 1002247 997761 993544 989536 985638 981719 977643 973311 968708 963921 959121 954507 950235
254834I50235l893l602l506l634l941m316m647m844m872m746m502m181l820l451
$$ 950235 946342 942740 939234 935600 931659 927343 922696 917852 912980 908234 903732 899551 895731 892280
254820H92280l132k925k900l091l455l874m178m221l941l421k859k507k558l052
$$ 892280 889148 886223 883323 880232 876777 872903 868725 864504 860563 857142 854283 851776 849218 846166
254806H46166l842m648n157n166m660l832k996k463k415k828l497m129m464m377
$$ 846166 842324 837676 832519 827353 822693 818861 815865 813402 810987 808159 804662 800533 796069 791692
254792G91692l920l282k701k370k370k646l067l462l710l759l632l403l170l006
$$ 791692 787772 784490 781789 779419 777049 774403 771336 767874 764164 760405 756773 753370 750200 747194
254778G47194k956l018l158l319l433l457l374l215l046k949k980l141l373l558
$$ 747194 744238 741220 738062 734743 731310 727853 724479 721264 718218 715269 712289 709148 705775 702217
254764G02217l584l372k942k393j893j604j626j965k523l143l662l966m007l813
$$ 702217 698633 695261 692319 689926 688033 686429 684803 682838 680315 677172 673510 669544 665537 661724
254750F61724l454l026k613k292k126k154k381k768l220l601l780l678l306k767
$$ 661724 658270 655244 652631 650339 648213 646059 643678 640910 637690 634089 630309 626631 623325 620558
254736F20558k242j904j860k107k531k959l225l247l045k722k415k235k215k314
$$ 620558 618316 616412 614552 612445 609914 606955 603730 600483 597438 594716 592301 590066 587851 585537
254722E85537k443k516k479k335k120j892j698j569j522j578j744k017k354k675
$$ 585537 583094 580578 578099 575764 573644 571752 570054 568485 566963 565385 563641 561624 559270 556595
254708E56595k865k823k505j960j330q08n67o89j128j725k259k548k503k179j723
$$ 556595 553730 550907 548402 546442 545112 544304 543737 543048 541920 540195 537936 535388 532885 530706 528983
254693E28983j328j152j253j580k002k364k541k486k225j848j467j179j045j073
$$ 528983 527655 526503 525250 523670 521668 519304 516763 514277 512052 510204 508737 507558 506513 505440
254679E05440j222j423j592j669j620j470j280j133j096j194j394j609j751j755
$$ 505440 504218 502795 501203 499534 497914 496444 495164 494031 492935 491741 490347 488738 486987 485232
254665D85232j621j419j244j185j271j453j632j701j601j357j058q27p48q43j047
$$ 485232 483611 482192 480948 479763 478492 477039 475407 473706 472105 470748 469690 468863 468115 467272 466225
254650D66225j254j362j334j200j045r60r89j108j246j314j268j121r48q40q56
$$ 466225 464971 463609 462275 461075 460030 459070 458081 456973 455727 454413 453145 452024 451076 450236 449380
254635D49380r98j205j386j456j383j183r16o51m30k75j80j34j31j83k89m41o15
$$ 449380 448382 447177 445791 444335 442952 441769 440853 440202 439772 439497 439317 439183 439052 438869 438580 438139 437524
254618D37524p74q99r87j062j151j255j350j379j295j092q30o14n48o85r68j262
$$ 437524 436750 435851 434864 433802 432651 431396 430046 428667 427372 426280 425450 424836 424288 423603 422635 421373
254602D21373j393j241q11k49K09L38L3o34j435k073k320k100j521q24k62Ok7
$$ 421373 419980 418739 417928 417679 417888 418226 418259 417625 416190 414117 411797 409697 408176 407352 407090 407096 407069
254585D07069k46m78o07o18o01o74r06j256j593j751j631j258p82m13l21n46r90
$$ 407069 406823 406345 405738 405120 404519 403845 402939 401683 400090 398339 396708 395450 394668 394255 393934 393388 392398
254568C92398j456j746j755j511j148q27o62o52p16p37o56n01l82m29p11j173
$$ 392398 390942 389196 387441 385930 384782 383955 383293 382641 381925 381188 380532 380031 379649 379220 378509 377336
254552C77336j670k005k031j724j189o25k39j50l68p82j233j576j732j705j553
$$ 377336 375666 373661 371630 369906 368717 368092 367853 367703 367335 366553 365320 363744 362012 360307 358754
254537C58754j352j171j049j010j061j193j378j544j600j453j069n00R3N01N38
$$ 358754 357402 356231 355182 354172 353111 351918 350540 348996 347396 345943 344874 344374 344467 344968 345506
254522C45506J33o21j483k148k372k064j340m59K71O32N71K08k34n42o17m94l26
$$ 345506 345639 345018 343535 341387 339015 336951 335611 335152 335423 336055 336626 336834 336600 336058 335441 334947 334621
254505C34621k83m67q57j321j686j812j659j295q45m51j89p0n4r2j53k41l82n76
$$ 334621 334338 333871 333014 331693 330007 328195 326536 325241 324396 323945 323756 323686 323632 323540 323387 323146 322764 322188
254487C22188p92r73j051j003q57o91n89n97o89p84p83o31l52n6J15M9k69p45
$$ 322188 321396 320423 319372 318369 317512 316821 316232 315635 314946 314162 313379 312748 312396 312340 312455 312504 312235 311490
254469C11490j209j489j485j220q27m85l43m55p59j121j389j477j384j192j008
$$ 311490 310281 308792 307307 306087 305260 304775 304432 303977 303218 302097 300708 299231 297847 296655 295647
254454B95647r11r15r64r81r12p73o36o02p44j051j428j732j822j639j234p53
$$ 295647 294736 293821 292857 291876 290964 290191 289555 288953 288209 287158 285730 283998 282176 280537 279303 278550
254438B78550l81k66m50q47j277j533j473j070m39K16O67P57M48j53q54j438j740
$$ 278550 278169 277903 277453 276606 275329 273796 272323 271253 270814 271030 271697 272454 272902 272749 271895 270457 268717
254421B68717j705j389r30m86j70l7n7j72l23m85o65q91j165j445j647j669j449
$$ 268717 267012 265623 264693 264207 264037 264000 263943 263771 263448 262963 262298 261407 260242 258797 257150 255481 254032
254404B54032j002m38P5L67L36J1m76r17j119r91n73k8M30O15M53ln92j126j460
$$ 254032 253030 252592 252667 253034 253370 253381 252905 251988 250869 249878 249305 249277 249707 250322 250775 250772 250180 249054 247594
254385B47594j536j404j165r35p75p00o71o49o23o07o37p24q46r28r04p30m38
$$ 247594 246058 244654 243489 242554 241779 241079 240408 239759 239136 238529 237892 237168 236322 235394 234490 233760 233322
254368B33322j31N9K5k57p03j155j444j465j222q31m70k93l71o62j028j313j400
$$ 233322 233191 233250 233275 233018 232315 231160 229716 228251 227029 226198 225728 225435 225064 224402 223374 222061 220661
254351B20661j267r77o51l92k61k48l04l75m44n36o93r48j285j639j919k043j985
$$ 220661 219394 218417 217766 217374 217113 216865 216561 216186 215742 215206 214513 213565 212280 210641 208722 206679 204694
254334B04694j770j473j167r10p10n56m41l74m05n78r06j337j759k030k046j785
$$ 204694 202924 201451 200284 199374 198664 198108 197667 197293 196888 196310 195404 194067 192308 190278 188232 186447
254318A86447j330q35m68l37m44p01r64j120j122j013q88q34q80r86j066j046
$$ 186447 185117 184282 183814 183477 183033 182332 181368 180248 179126 178113 177225 176391 175511 174525 173459 172413
254302A72413r09p11n48m99n74p00p56o37l28P5M02M85K59j97o76r25p66j87O46
$$ 172413 171504 170793 170245 169746 169172 168472 167716 167079 166751 166826 167228 167713 167972 167775 167099 166174 165408 165221 165867
254283A65867J443J921J922J482Q14K08r1J4M39R77J397J554J439J177R51R05
$$ 165867 167310 169231 171153 172635 173449 173657 173566 173580 174019 174996 176393 177947 179386 180563 181514 182419
254267A82419J090J437J809K068K130J996J733J436J168R65Q22P36P21Q11J043
$$ 182419 183509 184946 186755 188823 190953 192949 194682 196118 197286 198251 199073 199809 200530 201341 202384
254252B02384J412J864K288K557K582K345J918J431J018P67O90P32Q08Q50Q36
$$ 202384 203796 205660 207948 210505 213087 215432 217350 218781 219799 220566 221256 221988 222796 223646 224482
254237B24482Q04P95Q35R01R13P81M59l1n69r87j126r06l69L22R38J264J185P22
$$ 224482 225286 226081 226916 227817 228730 229511 229970 229939 229370 228383 227257 226351 225982 226304 227242 228506 229691 230413
254219B30413L6o34j061j104p69k00L74P30P26L63k25q22j220j289j034n81j28
$$ 230413 230449 229815 228754 227650 226881 226681 227055 227785 228511 228874 228649 227827 226607 225318 224284 223703 223575
254202B23575J51J60o8m12p01q13p22m99k88k12l32n99q85j040r73o98l37o6m5
$$ 223575 223726 223886 223818 223406 222705 221892 221170 220671 220383 220171 219839 219240 218355 217315 216342 215644 215307 215241 215196
254183B15196l33q66j473j943k109j910j408p56j39K94M69M05J65j50m63p20q96
$$ 215196 214863 213997 212524 210581 208472 206562 205154 204398 204259 204553 205022 205427 205592 205442 204979 204259 203363
254166B03363r74r54q41o59m57k98k39l01m53o06o59n30k07K31O43Q63P84L95
$$ 203363 202389 201435 200594 199935 199478 199180 198941 198640 198187 197581 196922 196392 196185 196416 197059 197922 198706 199101
254148A99101j96p95j202j271r84m49J35N62O87M85N9m17p58q55p03m09j23J6
$$ 199101 198905 198110 196908 195637 194653 194204 194339 194901 195588 196073 196132 195715 194957 194102 193399 192990 192867 192883
254130A92883n1k75n33o81o21l57J1L29M60L48N0k88n01m72k02J96N35O46M52
$$ 192883 192832 192557 192024 191343 190722 190365 190376 190705 191165 191513 191563 191275 190774 190302 190100 190296 190831 191477 191929
254111A91929Jn37r51j075q52l68K00O43Q08O45K16l41q69j246j400j327j052
$$ 191929 191930 191393 190442 189367 188515 188147 188347 188990 189798 190443 190659 190318 189449 188203 186803 185476 184424
254094A84424o29j28L70P59R39Q39M59j16p21j170j321j143p36k89qj8l09p37
$$ 184424 183795 183667 184037 184796 185735 186574 187033 186917 186196 185026 183705 182562 181826 181537 181529 181511 181202 180465
254076A80465j088j180r38m47J03N00N94L72m9m88p81q64p77o40n69o21p61q81
$$ 180465 179377 178197 177259 176812 176915 177415 178009 178381 178332 177844 177063 176199 175422 174782 174213 173592 172831 171950
254058A71950q71o76l32N2L45M57L80J80m1j91k41k12j72j58j84k21k25j87j36
$$ 171950 171079 170403 170071 170123 170468 170925 171305 171485 171444 171253 171012 170800 170628 170470 170286 170065 169840 169653 169517
254039A69517j42k74n38q79j161j251j061o11l0N01Q02P93N06P9l19n41n38l63
$$ 169517 169375 169101 168563 167684 166523 165272 164211 163600 163570 164071 164873 165666 166172 166251 165932 165391 164853 164490
254021A64490j17Q0J65J41N8j5m7m7o7j55l27n51p51q46p86n75k69M1K68L57K95
$$ 164490 164373 164453 164618 164759 164817 164802 164755 164708 164641 164486 164159 163608 162857 162011 161225 160650 160381 160422 160690 161047 161342
254000A61342J14j38l97o15p49p78o96n21k97p7Q2J43J09K7m1k6R6K96N05O35
$$ 161342 161456 161318 160921 160306 159557 158779 158083 157562 157265 157188 157270 157413 157522 157549 157508 157482 157578 157874 158379 159014
253980A59014O21M56J91q1k69l25k55j25j0L3j1j00j73j80j05J4J15J38N6j17
$$ 159014 159635 160091 160282 160201 159932 159607 159352 159227 159217 159250 159239 159139 158966 158786 158681 158695 158810 158948 159004 158887
253960A58887l28n14o24o48n95m93l57j95kK17M33N97O46N48L10%k86m48m43k97
$$ 158887 158559 158045 157421 156773 156178 155685 155328 155133 155131 155348 155781 156378 157024 157572 157882 157882 157596 157148 156705 156408
253940A56408j00L3J6j60m13o03n96l25J58O98J084J136P85J04p01j375j702j596
$$ 156408 156308 156341 156357 156197 155784 155181 154585 154260 154418 155116 156200 157336 158121 158225 157524 156149 154447 152851
253922A52851j114m48J71N54O26M43J47r9j90j19L8J64J73N3j38k93l24k09NK17
$$ 152851 151737 151289 151460 152014 152640 153083 153230 153131 152941 152822 152860 153024 153197 153250 153112 152819 152495 152286 152291 152508
253902A52508L33L15K00P2J8P2J89K70K08l2m03p67r80r45o89l51j18j44m63r62
$$ 152508 152841 153156 153356 153428 153446 153518 153707 153977 154185 154153 153750 152983 152003 151058 150369 150018 149900 149756 149293 148331
253882A48331j423j631j464r70l34J92M08K69j13n05o79n18o0N09R53J094Q90
$$ 148331 146908 145277 143813 142843 142509 142701 143109 143378 143265 142760 142081 141563 141503 142012 142965 144059 144949
253865A44949M44n5m24n75n35m16l43l88n26o65p12o26m45k68j96k67m28n69n81
$$ 144949 145393 145338 144914 144339 143804 143388 143045 142657 142131 141466 140754 140128 139683 139415 139219 138952 138524 137955 137374
253846A37374m20j43J13K17J02j72m47n40l34J35O98J104J151P69P4o84j219j347
$$ 137374 136954 136811 136924 137141 137243 137071 136624 136084 135750 135885 136583 137687 138838 139607 139681 138997 137778 136431
253828A36431j042m69J19M80M99K15j95n21o09m39j17J82L01J73j51n26p92q34
$$ 136431 135389 134920 135039 135519 136018 136233 136038 135517 134908 134469 134352 134534 134835 135008 134857 134331 133539 132705
253810A32705o42l00M6K57K52M5k77n77p37o87m40q0K60M55M20J49k93p77j164
$$ 132705 132063 131763 131809 132066 132318 132363 132086 131509 130772 130085 129645 129565 129825 130280 130700 130849 130556 129779 128615
253791A28615j353j305j065p20l72q6J30L12N14P43R56J054R31N45m8o89j160
$$ 128615 127262 125957 124892 124172 123800 123714 123844 124156 124670 125413 126369 127423 128354 128899 128851 128162 127002
253774A27002j289j008m12K73P86R26O38M7o18j106j258j064o42j82J56L02K97
$$ 127002 125713 124705 124293 124566 125352 126278 126916 126963 126345 125239 123981 122917 122275 122093 122249 122551 122848
253757A22848K41K29K85L56L50J85j37n34q69j026r68p54n08l50l31l95m24k93
$$ 122848 123089 123318 123603 123959 124309 124494 124357 123823 122954 121928 120960 120206 119698 119348 119017 118622 118198 117905
253739A17905M2N12R51J175J067O40M0n21q52q74o44l09m3N2j9j57k40j83jK11
$$ 117905 117947 118459 119410 120585 121652 122292 122332 121811 120959 120085 119441 119132 119089 119141 119122 118965 118725 118542 118541 118752
253719A18752L30K65K6k89n34n98m48j58J36K95K48Rl26o37q44r21r06q57q19
$$ 118752 119082 119347 119373 119084 118550 117952 117504 117346 117482 117777 118025 118034 117708 117071 116227 115306 114400 113543 112724
253700A12724p89p27n96l89j51M3J09J8j98m53o46p07o39n01l81l59m51o16p82
$$ 112724 111935 111208 110612 110223 110072 110115 110224 110242 110044 109591 108945 108238 107599 107098 106717 106358 105907 105291 104509
253681A04509q75q68p80o66n87n75o21o99p74q40r07r94j104j204j230j131q86
$$ 104509 103634 102766 101986 101320 100733 100158 99537 98838 98064 97224 96317 95323 94219 93015 91785 90654 89768
253664H9768n42j91N4J21J2j92l63l94k50J7K82M13L30N7l06o04p27o39m05j52
$$ 89768 89226 89035 89089 89210 89222 89030 88667 88273 88023 88040 88322 88735 89065 89122 88816 88212 87485 86846 86441 86289
253644H6289j1n0k52n17p24p77o50l86q1J86L60M47M82N03N26N38N04M01K43P6
$$ 86289 86278 86228 85976 85459 84735 83958 83308 82922 82841 83027 83387 83834 84316 84819 85345 85883 86387 86788 87031 87107
253624H7107l2k4J16L51O06P95Q46P39N02J98q5k81l44k65p4J81M28O01O56N80
$$ 87107 87075 87051 87167 87518 88124 88919 89765 90504 91006 91204 91119 90838 90494 90229 90155 90336 90764 91365 92021 92601
253604I2601M02J92K6k4N9K39M31N29M53J88k06o11q94r44p30k95K50P75J160
$$ 92601 93003 93195 93221 93197 93256 93495 93926 94455 94908 95096 94890 94279 93385 92441 91711 91416 91666 92441 93601
253585I3601J338J292J063P27L56L0k00l11l15k46j62j11j20j66j95j30P9M26
$$ 93601 94939 96231 97294 98021 98377 98407 98207 97896 97581 97335 97173 97062 96942 96776 96581 96451 96530 96956
253567I6956Q33J164J287J122O88J11m23p47p74n41j86J14K26J09j62m52o36o55
$$ 96956 97789 98953 100240 101362 102050 102161 101738 100991 100217 99676 99490 99604 99830 99939 99777 99325 98689 98034
253549I8034n45m12l45l89m91n34m12q5L76Q11J043R57N58k0n77r26r71p43l60
$$ 98034 97489 97077 96732 96343 95852 95318 94906 94821 95197 96008 97051 98008 98566 98546 97969 97043 96072 95329 94969
253530I4969J6K70L66L37K59J93J52J18O1k5j10j38q3L8J43J30o9m40q79j214
$$ 94969 94985 95255 95621 95958 96217 96410 96562 96680 96741 96716 96606 96468 96385 96423 96566 96696 96627 96187 95308 94094
253510I4094j297j065n76PM89P28O97M85K39R1R1J93K79K48O4k10m56n56m70k45
$$ 94094 92797 91732 91156 91163 91652 92380 93077 93562 93801 93892 93983 94176 94455 94703 94767 94557 94101 93545 93075 92830
253490I2830oJ22P6j04l04l97l09q0J66K72J31k45p37j154j325j170p38j74L33
$$ 92830 92824 92946 93022 92918 92614 92217 91908 91828 91994 92266 92397 92152 91415 90261 88936 87766 87028 86854 87187
253471H7187O44O99N41K64k3k49l88m51m57m16l21j73K4K32M03M95M83L78K09
$$ 87187 87831 88530 89071 89335 89312 89063 88675 88224 87767 87351 87030 86857 86881 87113 87516 88011 88494 88872 89081
253452H9081J2j79l43m55m93m24k29O2L86O34P05N56K41j04l02k23J37O47J072
$$ 89081 89093 88914 88571 88116 87623 87199 86970 87032 87418 88052 88757 89313 89554 89450 89148 88925 89062 89709 90781
253433I0781J179Q58J69o54j299j524j257o37M7M94N21J50m09q75j020p89l07
$$ 90781 91960 92818 92987 92333 91034 89510 88253 87616 87663 88157 88678 88828 88419 87544 86524 85735 85428
253416H5428J86M61M12J04k77n25n23l02j2J64J21j17m07n70m95k08J38L33K26
$$ 85428 85614 86075 86487 86591 86314 85789 85266 84964 84952 85116 85237 85120 84713 84143 83648 83440 83578 83911 84137
253397H4137j94p79j292j504j312p80j02M81P85P61M91J38j33k27j42O5L02N04
$$ 84137 83943 83164 81872 80368 79056 78276 78174 78655 79440 80201 80692 80830 80697 80470 80328 80393 80695 81199
253379H1199O35O89O54N16K57j10n20q55r85q27l85K23Q08J177J215R33M54l6
$$ 81199 81834 82523 83177 83693 83950 83840 83320 82465 81480 80653 80268 80491 81299 82476 83691 84624 85078 85042
253361H5042l68m65l52j34O2J58J38N0l5p2n7k4rl3p5j08j01p3o4j24k69m58n96
$$ 85042 84674 84209 83857 83723 83785 83943 84081 84131 84096 84024 83967 83943 83934 83901 83826 83718 83617 83544 83480 83356 83087 82629 82033
253338H2033n77l42P6N64R54J113R94O66K81Mo6N5K49L70L05N4k80n31n66l53
$$ 82033 81456 81114 81190 81754 82708 83821 84815 85481 85762 85766 85700 85755 86004 86374 86679 86733 86453 85922 85356 85003
253318H5003J9L71N17L64n6n75r78j086q45l32K59P17Q94P53L88l9l61m69l51
$$ 85003 85022 85393 85910 86274 86218 85643 84665 83579 82734 82402 82661 83378 84272 85025 85413 85374 85013 84544 84193
253299H4193p6K39M85N85N21L31O9j89l81m64m21k60k9K11L78M09K80K8k65m88
$$ 84193 84117 84356 84841 85426 85947 86278 86347 86158 85777 85313 84892 84632 84603 84814 85192 85601 85881 85909 85644 85156
253279H5156n39l80m8L52O75Q05O87L67m5l98n79n43l40q4R3J05n6l11n34n99
$$ 85156 84617 84237 84189 84541 85216 86021 86708 87075 87030 86632 86053 85510 85170 85086 85179 85284 85228 84917 84383 83784
253259H3784m46j01L28O94Q74Q09N30J39k25m57n02l86j76M1J99K84L10L17L32
$$ 83784 83338 83237 83565 84259 85133 85942 86472 86611 86386 85929 85427 85041 84865 84906 85105 85389 85699 86016 86348
253240H6348L53L53K97J65l0k40l98m43l43j16J91N03P43Q61Q27O50L68L9k65
$$ 86348 86701 87054 87351 87516 87486 87246 86848 86405 86062 85946 86137 86640 87383 88244 89071 89721 90089 90128 89863
253221H9863m61m89l17L1M75Q87J133J101P56J57n63j227j673j805j621j203o88
$$ 89863 89402 88913 88596 88627 89102 89989 91122 92223 92979 93136 92573 91346 89673 87868 86247 85044 84356
253204H4356k17J12K73K90K37J81J67K04K58K93K68J73L1j22k34k64k07q1O3J67
$$ 84356 84139 84251 84524 84814 85051 85232 85399 85603 85861 86154 86422 86595 86626 86504 86270 86006 85799 85718 85781 85948
253184H5948J75P6j08l21m89n54n03l59j83m2L2M3L8P1J69L08M15L97K03j62n94
$$ 85948 86123 86199 86091 85770 85281 84727 84224 83865 83682 83640 83672 83715 83753 83824 83993 84301 84716 85113 85316 85154 84560
253163H4560r46j071r04m78O0N16P30O33K81j70n31o60n07j33L22P06R00Q52N84
$$ 84560 83614 82543 81639 81161 81221 81737 82467 83100 83381 83211 82680 82020 81513 81380 81702 82408 83308 84160 84744
253144H4744J58l41q35j245j501j542j340r07l26K62P09Q87P69M28J4k98l87k41
$$ 84744 84902 84561 83726 82481 80980 79438 78098 77191 76865 77127 77836 78723 79492 79920 79934 79636 79249 79008
253126G9008N0L29M55L58P4k81n72p05o72n47m29m03m84o22K39213K04K55K24
$$ 79008 79058 79387 79842 80200 80274 79993 79421 78716 78044 77497 77068 76665 76181 75559 314772 314976 315231 315455
253108C15455J85K13L29N03O54O94N75L01n6l99o32p04o15m18j87QJ23J51J17
$$ 315455 315640 315853 316182 316685 317339 318033 318608 318909 318853 318454 317822 317118 316503 316085 315898 315906 316029 316180 316297
253089C16297O4L2M5J06K02L07L98M51M59M15L19J74qk03l72m67m42k77J6L68
$$ 316297 316361 316393 316438 316544 316746 317053 317451 317902 318361 318776 319095 319269 319261 319058 318686 318219 317777 317500 317516 317884
253069C17884O85Q66Q51O43L26L4j08j8K82O85J032J178J048O80J94k49n22n74
$$ 317884 318569 319435 320286 320929 321255 321289 321181 321163 321445 322130 323162 324340 325388 326068 326262 326013 325491 324917
253051C24917m52k51p3L2P9J24K26L87N46O00M61J06l90q79j201j242j001n69
$$ 324917 324465 324214 324141 324173 324252 324376 324602 324989 325535 326135 326596 326702 326312 325433 324232 322990 321989 321420
253033C21420j05K53M28M36L60K91K91L48M21M57M43M18M44N64P69R81J094J036
$$ 321420 321315 321568 321996 322432 322792 323083 323374 323722 324143 324600 325043 325461 325905 326469 327238 328219 329313 330349
253015C30349Q09N17L08L10N48R20J219J236Q57J33p19j402j656j381o69K10R42
$$ 330349 331158 331675 331983 332293 332841 333761 334980 336216 337073 337206 336487 335085 333429 332048 331379 331589 332531
252998C32531J265J093N24k16q64j219j214q96l94J53O41J021J276J401J394J252
$$ 332531 333796 334889 335413 335197 334333 333114 331900 331004 330610 330763 331404 332425 333701 335102 336496 337748
252982C37748R95O79L84J90J41K06K93K98J35j88n83r03j015q55m76qL80N70N30
$$ 337748 338743 339422 339806 339996 340137 340343 340636 340934 341069 340881 340298 339395 338380 337525 337049 337041 337421 337991 338521
252963C38521L43J39M9J24L24N31O11M81J41l10p32r81r82p35l14J67N98Q95J024
$$ 338521 338864 339003 339052 339176 339500 340031 340642 341123 341264 340954 340222 339241 338259 337524 337210 337377 337975 338870 339894
252944C39894R85Q12N48K57Kj66k04j14P2K88M59N31M96L83K55J67J44J78K20
$$ 339894 340879 341691 342239 342496 342498 342332 342128 342014 342086 342374 342833 343364 343860 344243 344498 344665 344809 344987 345207
252925C45207K28J83J05M3M7J26K49L45L40K04k8k59l74k88JM16Q15J068J094
$$ 345207 345435 345618 345723 345766 345813 345939 346188 346533 346873 347077 347049 346790 346416 346128 346129 346545 347360 348428 349522
252906C49522R13O27L62K20K22L08L68L12J17j51l67m02k00J98O57J007J118R57
$$ 349522 350435 351062 351424 351644 351866 352174 352542 352854 352971 352820 352453 352051 351851 352049 352706 353713 354831 355788
252888C55788O08K29j4k0J98N31Q21R33Q18N28J84q1j75j00Q4K63L57L37K36J29
$$ 355788 356396 356625 356611 356591 356789 357320 358141 359074 359892 360420 360604 360523 360348 360248 360332 360595 360952 361289 361525 361654
252868C61654Q2J21K17L02L11K19N4j14k01j67j8J64K86K62P0k46n73p86p83n29
$$ 361654 361736 361857 362074 362376 362687 362906 362960 362846 362645 362478 362460 362624 362910 363172 363242 362996 362423 361637 360854 360325
252848C60325p2M74R66J274J323J118P37L11k1j48l3K87P02J066J250J177Q58
$$ 360325 360253 360727 361693 362967 364290 365408 366145 366456 366435 366287 366254 366541 367243 368309 369559 370736 371594
252831C71594L85j07m91o84o88n63m07k92k38k05j17P8L83P28J000J091R67O76
$$ 371594 371979 371872 371381 370697 370009 369446 369039 368747 368509 368304 368187 368265 368648 369376 370376 371467 372434 373110
252813C73110L47J37J40L61O86R42R74P19K41k83o49p02m20Q3N96R13R13O12J47
$$ 373110 373457 373594 373734 374095 374781 375723 376697 377416 377657 377374 376725 376023 375603 375686 376282 377195 378108 378720 378867
252794C78867k76m87m10j02K91N89O66M94J38k59n56o48n11j89K26O30R37J085
$$ 378867 378591 378104 377694 377592 377883 378472 379138 379632 379770 379511 378955 378307 377796 377607 377833 378463 379400 380485
252776C80485J057Q67N61K15q5k55k47o5K17M89O24N47K54j59n49p54o81l28K00
$$ 380485 381542 382409 382970 383185 383100 382845 382598 382533 382750 383239 383863 384410 384664 384505 383956 383202 382521 382193 382393
252757C82393P42J129J262J128Q11M40J36k8m7L1J51K67L72M86O29P82Q99R10
$$ 382393 383135 384264 385526 386654 387465 387905 388041 388013 387966 387997 388148 388415 388787 389273 389902 390684 391583 392493
252739C92493P56M41M0l23n07m29j00L67P86R83Q59M36j41o60r28q46m56Q8N69
$$ 392493 393249 393690 393730 393407 392900 392471 392371 392738 393524 394507 395366 395802 395661 395001 394073 393227 392771 392859 393428
252720C93428Q03P15L55j25n28p12o24l19P8M46P01Q46R34J039J183J336J411
$$ 393428 394231 394946 395301 395176 394648 393936 393312 392993 393071 393517 394218 395064 395998 397037 398220 399556 400967
252703D00967J318J012N30j7m76p31p41n59l08j09l7q6j68j74l5K39N62P94Q21
$$ 400967 402285 403297 403827 403810 403334 402603 401862 401303 400995 400886 400849 400763 400595 400421 400386 400625 401187 401981 402802
252684D02802O09K18k19n43o56n46k94m2Q2J2k34n57q29r44q57n95k41J06L61
$$ 402802 403411 403629 403410 402867 402211 401665 401371 401329 401411 401423 401189 400632 399803 398859 398002 397407 397166 397272 397633
252665C97633M89M94M18L16K40K14K41K99L48L48K65R7j35l74n52o17n54l91k06
$$ 397633 398122 398616 399034 399350 399590 399804 400045 400344 400692 401040 401305 401402 401267 400893 400341 399724 399170 398779 398573
252646C98573p3n6j51l04m17m06k41L1K96M18K98o7n88j090j403j408j103n99
$$ 398573 398500 398444 398293 397989 397572 397166 396925 396956 397252 397670 397968 397901 397313 396223 394820 393412 392309 391710
252628C91710p3K94L86K01j60n43p98q36o59l43kK61L97M22L95L94M75O46Q65
$$ 391710 391637 391931 392317 392518 392358 391815 391017 390181 389522 389179 389177 389438 389835 390257 390652 391046 391521 392167 393032
252609C93032J053J130J042P84M18L6k42l32j98J27N46R33J171J199J029P40M47
$$ 393032 394085 395215 396257 397041 397459 397495 397253 396921 396723 396850 397396 398329 399500 400699 401728 402468 402915
252592D02915K69K59M17O66R07J051J058R47P86O48N82N88O27O38N77M47K93J86
$$ 402915 403184 403443 403860 404526 405433 406484 407542 408489 409275 409923 410505 411093 411720 412358 412935 413382 413675 413861
252574D13861J89L19N36P54Q78Q43O60L99J83J30L08O93J190J636J889J855J544
$$ 413861 414050 414369 414905 415659 416537 417380 418040 418439 418622 418752 419060 419753 420943 422579 424468 426323 427867
252557D27867J052N37J50j3M7K43M36N06L99J59q7j87l1L90R74J528J849J799
$$ 427867 428919 429456 429606 429593 429640 429883 430319 430825 431224 431383 431296 431109 431078 431468 432442 433970 435819 437618
252539D37618J366O81l6n47o89m36J04P24J206J397J255Q67L79l9k73k92j40R6
$$ 437618 438984 439665 439629 439082 438393 437957 438061 438785 439991 441388 442643 443510 443889 443850 443577 443285 443145 443241
252521D43241L21M84N65N90N92N89N94N87N63N12M49L88L47L30L24L09K69J95
$$ 443241 443562 444046 444611 445201 445793 446382 446976 447563 448126 448638 449087 449475 449822 450152 450476 450785 451054 451249
252503D51249R9Kp5j24j46j61j91k43l07l55l40k27%L26O94J028J247J293J149
$$ 451249 451348 451350 451275 451151 451005 450844 450653 450410 450103 449748 449408 449181 449181 449507 450201 451229 452476 453769 454918
252484D54918Q54M85J28j38k79l13k86k64k79l32l73l42j92P7M11P15Q95R00P49
$$ 454918 455772 456257 456385 456247 455968 455655 455369 455105 454826 454494 454121 453779 453587 453664 454075 454790 455685 456585 457334
252465D57334N18L15K31L05N01P39R16R68Q78O84M49K29N6p9j88k82l37l20j90
$$ 457334 457852 458167 458398 458703 459204 459943 460859 461827 462705 463389 463838 464067 464123 464044 463856 463574 463237 462917 462727
252446D62727N8L83P13R64J082J070R70Q53P71P28O84N86M03J62n7j57o6K00N52
$$ 462727 462785 463168 463881 464845 465927 466997 467967 468820 469591 470319 471003 471589 471992 472154 472097 471940 471874 472074 472626
252427D72626Q41R38P89M48N1k37l09j50J43M28N83N70M58L72M43P13J114J492
$$ 472626 473467 474405 475194 475642 475693 475456 475147 474997 475140 475568 476151 476721 477179 477551 477994 478707 479821 481313
252409D81313J674J544J116N13o6m47n38l66n7K46M29M73M32M09M82O64Q99J086
$$ 481313 482987 484531 485647 486160 486094 485647 485109 484743 484686 484932 485361 485834 486266 486675 487157 487821 488720 489806
252391D89806J134R99P18L89J25K3J06L44O49R14J052J019Q28N38K42L2j9J07
$$ 489806 490940 491939 492657 493046 493171 493194 493300 493644 494293 495207 496259 497278 498106 498644 498886 498918 498899 499006
252373D99006L66O55Q55Q57O27K25k07m81m51o1O02J342J913K121J897J320O01
$$ 499006 499372 500027 500882 501739 502366 502591 502384 501903 501452 501391 501993 503335 505248 507369 509266 510586 511187
252356E11187k4l77m13k20K1J35M3k17m94o12m52pN97J164J508J526J246Q04L80
$$ 511187 511163 510786 510373 510153 510174 510309 510352 510135 509641 509029 508577 508570 509167 510331 511839 513365 514611 515415 515795
252337E15795J30J20L09N78P99Q76P92O06M15L12L50N16P58R95J160J216J158
$$ 515795 515925 516045 516354 516932 517731 518607 519399 520005 520420 520732 521082 521598 522356 523351 524511 525727 526885
252320E26885J007Q03N82L76K19J38J55K73M66O85Q51Q94P71N00J52j54l02k22
$$ 526885 527892 528695 529277 529653 529872 530010 530165 530438 530904 531589 532440 533334 534105 534605 534757 534603 534301 534079
252302E34079P9N09R20J165J163R22N48K08L8J10L84P27R80J025Q47N37K53J43
$$ 534079 534158 534667 535587 536752 537915 538837 539385 539593 539631 539741 540125 540852 541832 542857 543704 544241 544494 544637
252284E44637K71N81R23J115J039O95K14k00l54j64L17R19J416J645J544J193
$$ 544637 544908 545489 546412 547527 548566 549261 549475 549275 548921 548757 549074 549993 551409 553054 554598 555791
252268E55791P43L63J49J03J47J77J24nj45k04j25Q6L60O01P37P47O78O06N97
$$ 555791 556534 556897 557046 557149 557296 557473 557597 557592 557447 557243 557118 557204 557564 558165 558902 559649 560327 560933 561530
252249E61530O69P94R10R56R15Q06O80N83N28M89M30L10J33o3k17k81k37j05O7
$$ 561530 562199 562993 563903 564859 565774 566580 567260 567843 568371 568860 569290 569600 569733 569670 569453 569172 568935 568830 568897
252230E68897K29L53M31M73M72M19K87P5j82m04m92l65j7M75R64J298J371J190
$$ 568897 569126 569479 569910 570383 570855 571274 571561 571636 571454 571050 570558 570193 570176 570651 571615 572913 574284 575474
252212E75474Q51N16L22L23M77O58P43O64M51K12O9J00K82N18O69O48M47J59q0
$$ 575474 576325 576841 577163 577486 577963 578621 579364 580028 580479 580691 580760 580860 581142 581660 582329 582977 583424 583583 583503
252193E83503j53k4K46N41P43P99P36O40N99O46P44Q04P51N69L28J55J72M26Q57
$$ 583503 583350 583326 583572 584113 584856 585655 586391 587031 587630 588276 589020 589824 590575 591144 591472 591627 591799 592225 593082
252174E93082J309J600J603J300Q00K70j13k50j50J02L92O27P88R03J024J172
$$ 593082 594391 595991 597594 598894 599694 599964 599851 599601 599451 599553 599945 600572 601360 602263 603287 604459
252158F04459J328J430J414J255R85O89M65L72M22N59O98P73P58O77N98N77O54
$$ 604459 605787 607217 608631 609886 610871 611560 612025 612397 612819 613378 614076 614849 615607 616284 616882 617459 618113
252141F18113Q15J016J198J312J334J263J124R41P54N89M78M44M84N81O92P73
$$ 618113 618928 619944 621142 622454 623788 625051 626175 627116 627870 628459 628937 629381 629865 630446 631138 631911
252125F31911P87P31O40N62N47O07P16Q17Q50Q00O92N89N64O50Q17R89J077J025
$$ 631911 632698 633429 634069 634631 635178 635785 636501 637318 638168 638968 639660 640249 640813 641463 642280 643269 644346 645371
252107F45371Q55O55N42O07Q60J221J549J704J608J283Q34M00J03mN4K13M00N67
$$ 645371 646226 646881 647423 648030 648890 650111 651660 653364 654972 656255 657089 657489 657592 657588 657642 657855 658255 658822
252089F58822P04Q18R13R74R78R22Q40Q00Q66J065J334J539J522J185N62j75p54
$$ 658822 659526 660344 661257 662231 663209 664131 664971 665771 666637 667702 669036 670575 672097 673282 673844 673669 672915
252072F72915r31n90J76J095J821K081J788J088K84l00m62k10K55O49P46M93J7
$$ 672915 671984 671394 671570 672665 674486 676567 678355 679443 679727 679427 678965 678755 679010 679659 680405 680898 680915
252055F80915m25n93l80J35P35J166J257R98N36Q0j93k21q5O4P5j05m20p35r11
$$ 680915 680490 679897 679517 679652 680387 681553 682810 683808 684344 684424 684231 684010 683925 683989 684064 683959 683539 682804 681893
252036F81893q73o49l37o0J10J81K10K67L82N13N68M66J87k02n55p30o40l17J12
$$ 681893 681020 680371 680034 679974 680084 680265 680475 680742 681124 681637 682205 682671 682858 682656 682101 681371 680731 680414 680526
252017F80526M59N71L97Jm50p75q38o17k00K61O08P39O45L91Q5j70l22l70l56
$$ 680526 680985 681556 681953 681954 681504 680729 679891 679274 679074 679335 679943 680682 681327 681718 681803 681633 681311 680941 680585
251998F80585l35l38l67l90l56k32j2K67N45P47Q14P33N33K94J08N8J86M79Q65
$$ 680585 680250 679912 679545 679155 678799 678567 678555 678822 679367 680114 680928 681661 682194 682488 682596 682654 682840 683319 684184
251979F84184J251J535J663J628J475J290J149J107J176J312J460J555J554J455
$$ 684184 685435 686970 688633 690261 691736 693026 694175 695282 696458 697770 699230 700785 702339 703794
251965G03794J291J129J039J078J280J620K042K441K719K788K626K274J836J451
$$ 703794 705085 706214 707253 708331 709611 711231 713273 715714 718433 721221 723847 726121 727957 729408
251951G29408J239J259J493J847K189K409K456K353K191K066K043K128K258K355
$$ 729408 730647 731906 733399 735246 737435 739844 742300 744653 746844 748910 750953 753081 755339 757694
251937G57694K353K251K104K007K045K239K554K890L138L230L160K978K764K584
$$ 757694 760047 762298 764402 766409 768454 770693 773247 776137 779275 782505 785665 788643 791407 793991
251923G93991K457K367K271K142J994J880J861J969K182K418K572K555K337J967
$$ 793991 796448 798815 801086 803228 805222 807102 808963 810932 813114 815532 818104 820659 822996 824963
251909H24963J539J169R30Q34Q42Q90R26R53J003J125J333J594J813J881J720
$$ 824963 826502 827671 828601 829435 830277 831167 832093 833046 834049 835174 836507 838101 839914 841795 843515
251894H43515J339Q27L47O4R1M42J019J656K175K440K412K135J731J336J064R68
$$ 843515 844854 845681 846028 846092 846183 846625 847644 849300 851475 853915 856327 858462 860193 861529 862593 863561
251878H63561J041J218J411J539J548J428J212R66P60O56O83Q29J047J275J456
$$ 863561 864602 865820 867231 868770 870318 871746 872958 873924 874684 875340 876023 876852 877899 879174 880630
251863H80630J564J613J640J696J809J971K138K240K229K091J869J640J489J476
$$ 880630 882194 883807 885447 887143 888952 890923 893061 895301 897530 899621 901490 903130 904619 906095
251849I06095J592J782J948K010J926J726J489J311J267J368J565J770J894J888
$$ 906095 907687 909469 911417 913427 915353 917079 918568 919879 921146 922514 924079 925849 927743 929631
251835I29631J767J585J421J341J360J458J582J687J751J779J789J792J766J675
$$ 929631 931398 932983 934404 935745 937105 938563 940145 941832 943583 945362 947151 948943 950709 952384
251821I52384J475J164P85M41K47K89N79J041J528J884K002J866J563J227R98
$$ 952384 953859 955023 955808 956249 956496 956785 957364 958405 959933 961817 963819 965685 967248 968475 969473
251806I69473R51J072J278J461J543J517J436J378J400J504J635J706J663J508
$$ 969473 970424 971496 972774 974235 975778 977295 978731 980109 981509 983013 984648 986354 988017 989525
251792I89525J316J191J226J439J774K111K334K376K260K073J931J908J997K125
$$ 989525 990841 992032 993258 994697 996471 998582 1000916 1003292 1005552 1007625 1009556 1011464 1013461 1015586
251778A015586K188K111J898J638J460J477J715K106K506K764K795K611K314K055
$$ 1015586 1017774 1019885 1021783 1023421 1024881 1026358 1028073 1030179 1032685 1035449 1038244 1040855 1043169 1045224
251764A045224J946K020K217K422K523K470K298K111K019K094K323K627K883K993
$$ 1045224 1047170 1049190 1051407 1053829 1056352 1058822 1061120 1063231 1065250 1067344 1069667 1072294 1075177 1078170
251750A078170K914K673K350K039J812J696J687J746J845J952K053K131K166K145
$$ 1078170 1081084 1083757 1086107 1088146 1089958 1091654 1093341 1095087 1096932 1098884 1100937 1103068 1105234 1107379
251736A107379K064J946J833J778J823J965K169K362K473K458K330K145J980J913
$$ 1107379 1109443 1111389 1113222 1115000 1116823 1118788 1120957 1123319 1125792 1128250 1130580 1132725 1134705 1136618
251722A136618J973K146K374K591K740K793K757K655K518K368K221K090J994J949
$$ 1136618 1138591 1140737 1143111 1145702 1148442 1151235 1153992 1156647 1159165 1161533 1163754 1165844 1167838 1169787
251708A169787J973K067K205K345K433K427K315K114J870J647J508J489J610J856
$$ 1169787 1171760 1173827 1176032 1178377 1180810 1183237 1185552 1187666 1189536 1191183 1192691 1194180 1195790 1197646
251694A197646K186K542K851L048L086K951K686K367K097J969K023K246K553K836
$$ 1197646 1199832 1202374 1205225 1208273 1211359 1214310 1216996 1219363 1221460 1223429 1225452 1227698 1230251 1233087
251680A233087L000K994K842K618K413K294K278K326K376K372K304K213K171K243
$$ 1233087 1236087 1239081 1241923 1244541 1246954 1249248 1251526 1253852 1256228 1258600 1260904 1263117 1265288 1267531
251666A267531K459K782L137L428L586L590L470L293L117K986K901K851K809K776
$$ 1267531 1269990 1272772 1275909 1279337 1282923 1286513 1289983 1293276 1296393 1299379 1302280 1305131 1307940 1310716
251652A310716K765K808K920L096L297L462L534L476L299L047K792K606K542K617
$$ 1310716 1313481 1316289 1319209 1322305 1325602 1329064 1332598 1336074 1339373 1342420 1345212 1347818 1350360 1352977
251638A352977K810L071L332L527L607L552L376L124K864K658K546K532K582K635
$$ 1352977 1355787 1358858 1362190 1365717 1369324 1372876 1376252 1379376 1382240 1384898 1387444 1389976 1392558 1395193
251624A395193K633K549K397K229K114K106K208K377K523K562K439K158J792J443
$$ 1395193 1397826 1400375 1402772 1405001 1407115 1409221 1411429 1413806 1416329 1418891 1421330 1423488 1425280 1426723
251610A426723J214J159J270J477J674J763J702J505J246J024R21R68J139J348
$$ 1426723 1427937 1429096 1430366 1431843 1433517 1435280 1436982 1438487 1439733 1440757 1441678 1442646 1443785 1445133
251596A445133J507J548J466J314J183J153J250J423J563J534J261P65J76l02
$$ 1445133 1446640 1448188 1449654 1450968 1452151 1453304 1454554 1455977 1457540 1459074 1460335 1461100 1461276 1460974
251582A460974m71k29L80J164J867K257K236J880J406J067J042J351J836K240
$$ 1460974 1460503 1460274 1460654 1461818 1463685 1465942 1468178 1470058 1471464 1472531 1473573 1474924 1476760 1479000
251568A479000K329K007J366O62J90J71O38J437K284K902L123K956K544K105J807
$$ 1479000 1481329 1483336 1484702 1485364 1485554 1485725 1486363 1487800 1490084 1492986 1496109 1499065 1501609 1503714 1505521
251553A505521J706J748J811J782J624J378J139R83R41R77J031J056J055J075
$$ 1505521 1507227 1508975 1510786 1512568 1514192 1515570 1516709 1517692 1518633 1519610 1520641 1521697 1522752 1523827
251539A523827J172J363J597J771J794J629J328J024Q52Q85J080J293J339J099
$$ 1523827 1524999 1526362 1527959 1529730 1531524 1533153 1534481 1535505 1536357 1537242 1538322 1539615 1540954 1542053
251525A542053N81p2o40r30q67n33j23J49J58q3m25o95p61o35m55m20o86j274
$$ 1542053 1542634 1542562 1541922 1540992 1540125 1539592 1539469 1539618 1539776 1539693 1539268 1538573 1537812 1537177 1536722 1536302 1535616 1534342
251507A534342k062k828l348l505l322k951k589k394k412k579k779k890k865k732
$$ 1534342 1532280 1529452 1526104 1522599 1519277 1516326 1513737 1511343 1508931 1506352 1503573 1500683 1497818 1495086
251493A495086k566k442k395k403k416k393k327k249k208k235k318k410k445k393
$$ 1495086 1492520 1490078 1487683 1485280 1482864 1480471 1478144 1475895 1473687 1471452 1469134 1466724 1464279 1461886
251479A461886k256k081j933j847j818j802j740j598j388j169j013r66j034j166
$$ 1461886 1459630 1457549 1455616 1453769 1451951 1450149 1448409 1446811 1445423 1444254 1443241 1442275 1441241 1440075
251465A440075j299j365j341j234j076q86o66l95n6L34P25J031J176J123R06O06
$$ 1440075 1438776 1437411 1436070 1434836 1433760 1432874 1432208 1431813 1431757 1432091 1432816 1433847 1435023 1436146 1437052 1437658
251449A437658L36J80J74K88M59O25P53Q51R49J084J253J441J611J736J819J881
$$ 1437658 1437994 1438174 1438348 1438636 1439095 1439720 1440473 1441324 1442273 1443357 1444610 1446051 1447662 1449398 1451217 1453098
251433A453098J947K016K056K028J901J695J485J381J467J754K167K547K740K653
$$ 1453098 1455045 1457061 1459117 1461145 1463046 1464741 1466226 1467607 1469074 1470828 1472995 1475542 1478282 1480935
251419A480935K318J887J566J529J828K373K957L354L417L143K677K236K025K132
$$ 1480935 1483253 1485140 1486706 1488235 1490063 1492436 1495393 1498747 1502164 1505307 1507984 1510220 1512245 1514377
251405A514377K509K999L413L622L609L472L368L419L676M064M441M650M594M281
$$ 1514377 1516886 1519885 1523298 1526920 1530529 1534001 1537369 1540788 1544464 1548528 1552969 1557619 1562213 1566494
251391A566494L823L388L137L158L440L873M299M567M583M351L959L549L265L200
$$ 1566494 1570317 1573705 1576842 1580000 1583440 1587313 1591612 1596179 1600762 1605113 1609072 1612621 1615886 1619086
251377A619086L363L680M021M258M306M165L917L679L569L634L847M103M281M292
$$ 1619086 1622449 1626129 1630150 1634408 1638714 1642879 1646796 1650475 1654044 1657678 1661525 1665628 1669909 1674201
251363A674201M130L865L636L563L714M061M502M900N146N198N100M949M841M838
$$ 1674201 1678331 1682196 1685832 1689395 1693109 1697170 1701672 1706572 1711718 1716916 1722016 1726965 1731806 1736644
251349A736644M935N073N179N199N130N022M941M942N044N214N400N547N632N665
$$ 1736644 1741579 1746652 1751831 1757030 1762160 1767182 1772123 1777065 1782109 1787323 1792723 1798270 1803902 1809567
251335A809567N691N747N849N974O069O070N944N694N384N108M966N030N310N756
$$ 1809567 1815258 1821005 1826854 1832828 1838897 1844967 1850911 1856605 1861989 1867097 1872063 1877093 1882403 1888159
251321A888159O254O681O930O952O782O517O294O240O421O814P307P749P983P924
$$ 1888159 1894413 1901094 1908024 1914976 1921758 1928275 1934569 1940809 1947230 1954044 1961351 1969100 1977083 1985007
251307A985007P585P075O570O245O220O512P042P654Q179Q492Q549Q397Q151P955
$$ 1985007 1992592 1999667 2006237 2012482 2018702 2025214 2032256 2039910 2048089 2056581 2065130 2073527 2081678 2089633
251293B089633P919Q086Q412Q779R044R084Q852Q406P888P483P347P547Q022Q608
$$ 2089633 2097552 2105638 2114050 2122829 2131873 2140957 2149809 2158215 2166103 2173586 2180933 2188480 2196502 2205110
251279B205110R102R339R284R035Q793Q770R090R721J0481J1106J1372J1188J0645
$$ 2205110 2214212 2223551 2232835 2241870 2250663 2259433 2268523 2278244 2288725 2299831 2311203 2322391 2333036
251266B333036R971R439R241R418R856J0356J0745J0956J1063J1212J1546J2095
$$ 2333036 2343007 2352446 2361687 2371105 2380961 2391317 2402062 2413018 2424081 2435293 2446839 2458934
251254B458934J2757J3335J3631J3551J3161J2651J2262J2158J2369J2776J3192
$$ 2458934 2471691 2485026 2498657 2512208 2525369 2538020 2550282 2562440 2574809 2587585 2600777
251243B600777J3460J3534J3506J3533J3762J4231J4853J5451J5856J6002J5951
$$ 2600777 2614237 2627771 2641277 2654810 2668572 2682803 2697656 2713107 2728963 2744965 2760916
251232B760916J5872J5956J6318J6944J7709J8446J9029J9440J9766K0137K0652
$$ 2760916 2776788 2792744 2809062 2826006 2843715 2862161 2881190 2900630 2920396 2940533 2961185
251221B961185K1308K2011K2614K3009K3178K3228K3332K3660K4306K5240K6345
$$ 2961185 2982493 3004504 3027118 3050127 3073305 3096533 3119865 3143525 3167831 3193071 3219416
251210C219416K7465K8466K9293K9967L0551L1126L1739L2419L3177L4030L4999
$$ 3219416 3246881 3275347 3304640 3334607 3365158 3396284 3428023 3460442 3493619 3527649 3562648
251199C562648L6086L7274L8488L9636M0635M1454M2143M2821M3618M4627M5858
$$ 3562648 3598734 3636008 3674496 3714132 3754767 3796221 3838364 3881185 3924803 3969430 4015288
251188D015288M7233M8623M9920N1076N2139N3208N4389N5741N7241N8816O0378
$$ 4015288 4062521 4111144 4161064 4212140 4264279 4317487 4371876 4427617 4484858 4543674 4604052
251177D604052O1888O3370O4909O6598O8495P0577P2766P4955P7058P9065Q1026
$$ 4604052 4665940 4729310 4794219 4860817 4929312 4999889 5072655 5147610 5224668 5303733 5384759
251166E384759Q3039Q5205Q7586R0189R2980R5901R8895J01930J04985J08061
$$ 5384759 5467798 5553003 5640589 5730778 5823758 5919659 6018554 6120484 6225469 6333530
251156F333530J11171J14347J17634J21096J24791J28739J32918J37249J41633
$$ 6333530 6444701 6559048 6676682 6797778 6922569 7051308 7184226 7321475 7463108
251147G463108J46002J50358J54785J59442J64489J70027J76052J82460J89089
$$ 7463108 7609110 7759468 7914253 8073695 8238184 8408211 8584263 8766723 8955812
251138H955812J95796K02513K09263K16144K23262K30675K38386K46349K54530
$$ 8955812 9151608 9354121 9563384 9779528 10002790 10233465 10471851 10718200 10972730
251129A0972730K62947K71687K80872K90599L00886L11652L22754L34048L45469
$$ 10972730 11235677 11507364 11788236 12078835 12379721 12691373 13014127 13348175 13693644
251120A3693644L57063L68973L81373L94396M08072M22341M37090M52219M67701
$$ 13693644 14050707 14419680 14801053 15195449 15603521 16025862 16462952 16915171 17382872
251111A7382872M83600N00020N17083N34863N53387N72648N92648O13421O35032
$$ 17382872 17866472 18366492 18883575 19418438 19971825 20544473 21137121 21750542 22385574
251102B2385574O57547O81004P05385P30640P56719P83629Q11444Q40291Q70303
$$ 22385574 23043121 23724125 24429510 25160150 25916869 26700498 27511942 28352233 29222536
251093B9222536R01570R34101R67846J002744J038781J076026J114616J154709
$$ 29222536 30124106 31058207 32026053 33028797 34067578 35143604 36258220 37412929
251085C7412929J196419J239786J284775J331325J379402J429033J480296J533278
$$ 37412929 38609348 39849134 41133909 42465234 43844636 45273669 46753965 48287243
251077D8287243J588016J644490J702633J762408J823862J887146J952490K020099
$$ 48287243 49875259 51519749 53222382 54984790 56808652 58695798 60648288 62668387
251069F2668387K090079K162386K236864K313334K391726K472132K554815K640104
$$ 62668387 64758466 66920852 69157716 71471050 73862776 76334908 78889723 81529827
251061H1529827K728269K819425K913491L010267L109542L211192L315215L421689
$$ 81529827 84258096 87077521 89991012 93001279 96110821 99322013 102637228 106058917
251053A06058917L530667L642091L755756L871370L988641M107372M227496M349010
$$ 106058917 109589584 113231675 116987431 120858801 124847442 128954814 133182310 137531320
251045A37531320M471870M595893M720721M845873M970873N095358N219148N342181
$$ 137531320 142003190 146599083 151319804 156165677 161136550 166231908 171451056 176793237
251037A76793237N464412N585678N705600N823622N939064O051242O159517O263271
$$ 176793237 182257649 187843327 193548927 199372549 205311613 211362855 217522372 223785643
251029B23785643O361835O454407O540040O617709O686446O745478O794279O832530
$$ 223785643 230147478 236601885 243141925 249759634 256446080 263191558 269985837 276818367
251021B76818367O859995O876430O881573O875292O857820O830000O793398O750207
$$ 276818367 283678362 290554792 297436365 304311657 311169477 317999477 324792875 331543082
251013C31543082O702915O653865O604776O556364O508149O458362O404004O340938
$$ 331543082 338245997 344899862 351504638 358061002 364569151 371027513 377431517 383772455
251005C83772455O264083O167706O045877N893043N704611N477375N209629M900867
$$ 383772455 390036538 396204244 402250121 408143164 413847775 419325150 424534779 429435646
250997D29435646M551236M160927L729833L257671K744666K192589J605831R92208
$$ 429435646 433986882 438147809 441877642 445135313 447879979 450072568 451678399 452670607
250989D52670607L63190k66437q79455j457403j981963k436494k807733l087607
$$ 452670607 453033797 452767360 451887905 450430502 448448539 446012045 443204312 440116705
250981D40116705l275052l377354l410558l398478l370066l355493l381631l467981
$$ 440116705 436841653 433464299 430053741 426655263 423285197 419929704 416548073 413080092
250973D13080092l624022l848616m131489m456248m804004n156599n498795n819132
$$ 413080092 409456070 405607454 401475965 397019717 392215713 387059114 381560319 375741187
250965C75741187o109722o365492o583384o761826o900597p000827p064945p096400
$$ 375741187 369631465 363265973 356682589 349920763 343020166 336019339 328954394 321857994
250957C21857994p099182p077268p034237o973154o896718o807516o708210o601531
$$ 321857994 314758812 307681544 300647307 293674153 286777435 279969919 273261709 266660178
250949B66660178o490037o375819o260257o144012o027209n909800n791843n673664
$$ 266660178 260170141 253794322 247534065 241390053 235362844 229453044 223661201 217987537
250941B17987537n555795n438788n322990n208469n095049m982511m870782m760058
$$ 217987537 212431742 206992954 201669964 196461495 191366446 186383935 181513153 176753095
250933A76753095m650757m543383m438329m335753m235562m137502m041297l946753
$$ 176753095 172102338 167558955 163120626 158784873 154549311 150411809 146370512 142423759
250925A42423759l853783l762367l672467l583989l496790l410739l325783l241973
$$ 142423759 138569976 134807609 131135142 127551153 124054363 120643624 117317841 114075868
250917A14075868l159408l078163k998204k919367k841430k764225k687753k612229
$$ 114075868 110916460 107838297 104840093 101920726 99079296 96315071 93627318 91015089
250909I1015089k538020k465532k395046k326631k260151k195353k132016k070041
$$ 91015089 88477069 86011537 83616491 81289860 79029709 76834356 74702340 72632299
250901G2632299k009503j950564j893393j838054j784476j732499j681953j632760
$$ 72632299 70622796 68672232 66778839 64940785 63156309 61423810 59741857 58109097
250893E8109097j584934j538570j493739j450429j408507j367765j328008j289137
$$ 58109097 56524163 54985593 53491854 52041425 50632918 49265153 47937145 46648008
250885D6648008j251187j214296j178618j144229j111085j079023j047849j017414
$$ 46648008 45396821 44182525 43003907 41859678 40748593 39669570 38621721 37604307
250877C7604307r87694r58771r30782r03843q77959q53034q28905q05405p82450
$$ 37604307 36616613 35657842 34727060 33823217 32945258 32092224 31263319 30457914 29675464
250868B9675464p60048p38267p17179o96807o77090o57922o39206o20913o03096
$$ 29675464 28915416 28177149 27459970 26763163 26086073 25428151 24788945 24168032 23564936
250859B3564936n85877n69371n53624n38579n24083n09953m96045m82315m68822
$$ 23564936 22979059 22409688 21856064 21317485 20793402 20283449 19787404 19305089 18836267
250850A8836267m55697m43081m31055m19611m08665l98089l87762l77606l67600
$$ 18836267 18380570 17937489 17506434 17086823 16678158 16280069 15892307 15514701 15147101
250841A5147101l57759l48118l38712l29577l20740l12232l04082k96298k88859
$$ 15147101 14789342 14441224 14102512 13772935 13452195 13139963 12835881 12539583 12250724
250832A2250724k81697k74733k67880k61098k54403k47863k41555k35543k29829
$$ 12250724 11969027 11694294 11426414 11165316 10910913 10663050 10421495 10185952 9956123
250823I956123k24355k19022k13747k08484k03250j98102j93100j88268j83574
$$ 9956123 9731768 9512746 9298999 9090515 8887265 8689163 8496063 8307795 8124221
250814H124221j78962j74378j69825j65381j61168j57298j53810j50626j47574
$$ 8124221 7945259 7770881 7601056 7435675 7274507 7117209 6963399 6812773 6665199
250805F665199j44433j41038j37349j33466j29601j25985j22774j19981j17485
$$ 6665199 6520766 6379728 6242379 6108913 5979312 5853327 5730553 5610572 5493087
250796E493087j15088j12602j09947j07152j04355j01710r9315r7168r5176r3205
$$ 5493087 5377999 5265397 5155450 5048298 4943943 4842233 4742918 4645750 4550574 4457369
250786D457369r1151q8994q6801q4683q2738q0993p9396p7841p6222p4494p2686
$$ 4457369 4366218 4277224 4190423 4105740 4023002 3942009 3862613 3784772 3708550 3634056 3561370
250775C561370p0891o9225o7755o6484o5353o4265o3135o1925o0643n9334n8048
$$ 3561370 3490479 3421254 3353499 3287015 3221662 3157397 3094262 3032337 2971694 2912360 2854312
250764B854312n6818n5663n4580n3574n2648n1803n1007n0207m9323m8292m7106
$$ 2854312 2797494 2741831 2687251 2633677 2581029 2529226 2478219 2428012 2378689 2330397 2283291
250753B283291m5835m4603m3553m2778m2266m1901m1503m0917m0086l9090l8108
$$ 2283291 2237456 2192853 2149300 2106522 2064256 2022355 1980852 1939935 1899849 1860759 1822651
250742A822651l7348l6917l6777l6731l6513l5900l4833l3450l2043l0941l0369
$$ 1822651 1785303 1748386 1711609 1674878 1638365 1602465 1567632 1534182 1502139 1471198 1440829
250731A440829l0346l0677l1040l1118l0723k9874k8766k7682k6851k6376k6187
$$ 1440829 1410483 1379806 1348766 1317648 1286925 1257051 1228285 1200603 1173752 1147376 1121189
250720A121189k6099k5919k5523k4920k4231k3630k3242k3099k3106k3101k2913
$$ 1121189 1095090 1069171 1043648 1018728 994497 970867 947625 924526 901420 878319 855406
250709H55406k2455k1739k0897k0106j9529j9255j9260j9413j9536j9455j9064
$$ 855406 832951 811212 790315 770209 750680 731425 712165 692752 673216 653761 634697
250698F34697j8367j7469j6549j5799j5360j5267j5456j5765j6009j6040j5800
$$ 634697 616330 598861 582312 566513 551153 535886 520430 504665 488656 472616 456816
250687D56816j5339j4795j4335j4082j4071j4229j4413j4461j4262j3796j3142
$$ 456816 441477 426682 412347 398265 384194 369965 355552 341091 326829 313033 299891
250676B99891j2445j1854j1479j1343j1400j1542j1657j1662j1521j1251j0895
$$ 299891 287446 275592 264113 252770 241370 229828 218171 206509 194988 183737 172842
250665A72842j0506j0124r771r447r155q903q718q632q685q886r210r578r879
$$ 172842 162336 152212 142441 132994 123839 114936 106218 97586 88901 80015 70805 61227 51348
250652E1348r989r820r354q677E554a825p120p222p599q044q305q184p627o760
$$ 51348 41359 31539 22185 13508 5554 -1825 -8945 -16167 -23766 -31810 -40115 -48299 -55926 -62686
250638f2686n846n189n007n349o058o848p413p554p249o661o044n630n524n679
$$ -62686 -68532 -73721 -78728 -84077 -90135 -96983 -104396 -111950 -119199 -125860 -131904 -137534 -143058 -148737
250624a48737n917o047n949n640n261m992m965n179n506n735n691n313m692m038
$$ -148737 -154654 -160701 -166650 -172290 -177551 -182543 -187508 -192687 -198193 -203928 -209619 -214932 -219624 -223662
250610b23662l591l514l818m372m949n326n376n106m634m128l730l499l397l344
$$ -223662 -227253 -230767 -234585 -238957 -243906 -249232 -254608 -259714 -264348 -268476 -272206 -275705 -279102 -282446
250596b82446l257l105k932k822k854l059l387l722l922l890l598l123k605k206
$$ -282446 -285703 -288808 -291740 -294562 -297416 -300475 -303862 -307584 -311506 -315396 -318994 -322117 -324722 -326928
250582c26928k051k179k531k978l363l561l520l275k935k638k489k527k714k944
$$ -326928 -328979 -331158 -333689 -336667 -340030 -343591 -347111 -350386 -353321 -355959 -358448 -360975 -363689 -366633
250568c66633l091l071k859k530k197k001k023k268k658l054l314l348l144k774
$$ -366633 -369724 -372795 -375654 -378184 -380381 -382382 -384405 -386673 -389331 -392385 -395699 -399047 -402191 -404965
250554d04965k358k017j833j816j918k044k114k070j916j696j484j346j328j428
$$ -404965 -407323 -409340 -411173 -412989 -414907 -416951 -419065 -421135 -423051 -424747 -426231 -427577 -428905 -430333
250540d30333j617j833k012k107k090j977j793j586j395j242j124j024r23q25
$$ -430333 -431950 -433783 -435795 -437902 -439992 -441969 -443762 -445348 -446743 -447985 -449109 -450133 -451056 -451881
250526d51881p48p42q57j112j486j900k239k405k341k073j703j375j215j276j518
$$ -451881 -452629 -453371 -454228 -455340 -456826 -458726 -460965 -463370 -465711 -467784 -469487 -470862 -472077 -473353 -474871
250511d74871j812k001j957j652j161o46k79j87l85p86j227j542j621j449j108
$$ -474871 -476683 -478684 -480641 -482293 -483454 -484100 -484379 -484566 -484951 -485737 -486964 -488506 -490127 -491576 -492684
250496d92684p29m48l51m52p07j038j354j598j726j726j604j370j057p12m04k05
$$ -492684 -493413 -493861 -494212 -494664 -495371 -496409 -497763 -499361 -501087 -502813 -504417 -505787 -506844 -507556 -507960 -508165
250480e08165j71l15o05r58j278j475j511j400j200r82q04o84o03n26m21k93j71
$$ -508165 -508336 -508651 -509256 -510214 -511492 -512967 -514478 -515878 -517078 -518060 -518864 -519548 -520151 -520677 -521098 -521391 -521562
250463e21562j13j66l49o40r83j300j529j629j598j463j260j033q18o39n22m84
$$ -521562 -521675 -521841 -522190 -522830 -523813 -525113 -526642 -528271 -529869 -531332 -532592 -533625 -534443 -535082 -535604 -536088
250447e36088n35o77q92j142j381j557j636j603j468j258j010p70n76m64m63n85
$$ -536088 -536623 -537300 -538192 -539334 -540715 -542272 -543908 -545511 -546979 -548237 -549247 -550017 -550593 -551057 -551520 -552105
250431e52105q21j136j468j739j888j872j697j420j125q99q03q58j041j298j562
$$ -552105 -552926 -554062 -555530 -557269 -559157 -561029 -562726 -564146 -565271 -566170 -566973 -567831 -568872 -570170 -571732
250416e71732j781j919j960j893j715j429j054o28k21Q3K14J39j19m80q35j082
$$ -571732 -573513 -575432 -577392 -579285 -581000 -582429 -583483 -584111 -584332 -584249 -584035 -583896 -584015 -584495 -585330 -586412
250400e86412j160j074q70o36m45l36l17l70m68o01p71r70j168j296j272j023
$$ -586412 -587572 -588646 -589516 -590152 -590597 -590933 -591250 -591620 -592088 -592689 -593460 -594430 -595598 -596894 -598166 -599189
250384e99189n41R4P19J134J171P70J1q85j645k022j893j305m51L89R66J128Q73
$$ -599189 -599730 -599636 -598917 -597783 -596612 -595842 -595831 -596716 -598361 -600383 -602276 -603581 -604032 -603643 -602677 -601549 -600676
250367f00676L43k65p55j013j030q73o56m55l03j68%K41N42Q43J051J096R59O92
$$ -600676 -600333 -600598 -601353 -602366 -603396 -604269 -604925 -605380 -605683 -605851 -605851 -605610 -605068 -604225 -603174 -602078 -601119 -600427
250349f00427L98J92J45K57M45N87N61L08j39o68j121j356j302r81n05k9L14M46
$$ -600427 -600029 -599837 -599692 -599435 -598990 -598403 -597842 -597534 -597673 -598341 -599462 -600818 -602120 -603101 -603606 -603635 -603321 -602875
250331f02875L82K16P1N6K19N31R03J209J354J283J019O30K17j29l51m37m05l01
$$ -602875 -602493 -602277 -602206 -602150 -601931 -601400 -600497 -599288 -597934 -596651 -595632 -595002 -594785 -594914 -595265 -595702 -596107 -596408
250313e96408j58MJ79L68N65P45Q67Q78P53M92J43k06m56n26l81m8L84P97J078
$$ -596408 -596566 -596562 -596383 -596015 -595450 -594705 -593838 -592960 -592207 -591715 -591572 -591778 -592234 -592760 -593141 -593189 -592805 -592008 -590930
250294e90930J148R89O47K07k28n65p46p44n77k81Q0M25O80P76O79M07L0l30n53
$$ -590930 -589782 -588793 -588146 -587939 -588167 -588732 -589478 -590222 -590799 -591080 -591000 -590575 -589895 -589119 -588440 -588033 -588003 -588333 -588886
250275e88886n54l24N7M46O93P08N00J86o6j03J38N84J062J363J337R61L55k64
$$ -588886 -589440 -589764 -589707 -589261 -588568 -587860 -587360 -587174 -587240 -587343 -587205 -586621 -585559 -584196 -582859 -581898 -581543 -581807
250257e81807o75p51n00o2L65O19O39M90L21K77M33P49J092J302J271R93N70J63
$$ -581807 -582482 -583233 -583733 -583795 -583430 -582811 -582172 -581682 -581361 -581084 -580651 -579902 -578810 -577508 -576237 -575244 -574674 -574511
250239e74511q2r0J05L95O33P14O03L43L2k21l37k88r5J80M67P00Q36Q67Q21P54
$$ -574511 -574593 -574683 -574578 -574183 -573550 -572836 -572233 -571890 -571858 -572079 -572416 -572704 -572799 -572619 -572152 -571452 -570616 -569749 -568928 -568174
250219e68174P31Q09R98J246J456J514J338R35M01r0l66l20L2N52J033J299J261
$$ -568174 -567443 -566634 -565636 -564390 -562934 -561420 -560082 -559147 -558746 -558836 -559202 -559522 -559490 -558938 -557905 -556606 -555345
250202e55345R75O02L17K45L74N91P36O90M51J28j07j15J25N06Q36R32P23K80
$$ -555345 -554370 -553768 -553451 -553206 -552832 -552241 -551505 -550815 -550364 -550236 -550343 -550458 -550333 -549827 -548991 -548059 -547336 -547056
250184e47056k09n33n58l04Q6M07N00L40K9k46l25j54J80N06O42N06J50k67n56
$$ -547056 -547265 -547798 -548356 -548660 -548574 -548167 -547667 -547327 -547298 -547544 -547869 -548023 -547843 -547337 -546695 -546189 -546039 -546306 -546862
250165e46862n93l81m4K44L37J98r0l73m87l55JM65Q80J126J146R67O73L53Q7
$$ -546862 -547455 -547836 -547880 -547636 -547299 -547101 -547191 -547564 -548051 -548406 -548405 -547940 -547060 -545934 -544788 -543821 -543148 -542795 -542708
250146e42708q7j60j50q3RR5J45J54J44J58K54M67P75J105J332J341J077N83k0
$$ -542708 -542795 -542955 -543105 -543188 -543179 -543084 -542939 -542785 -542641 -542483 -542229 -541762 -540987 -539882 -538550 -537209 -536132 -535549 -535569
250127e35569n53q72r09p00l56rK56M15N10N94O87P67P76O78M95L21K77M52Q40
$$ -535569 -536122 -536994 -537903 -538603 -538959 -538968 -538712 -538297 -537787 -537193 -536506 -535739 -534963 -534285 -533790 -533469 -533192 -532740 -531900
250108e31900J316J687J771J485R06K28l12n34m01j0M49Q02R61R50Q57P75P34
$$ -531900 -530584 -528897 -527126 -525641 -524735 -524507 -524819 -525353 -525754 -525764 -525315 -524513 -523552 -522602 -521745 -520970 -520236
250091e20236O87N67L55J13KJ75O97J468K227K653K505J750N99n67j346j488j003
$$ -520236 -519549 -518982 -518627 -518514 -518512 -518337 -517640 -516172 -513945 -511292 -508787 -507037 -506438 -507005 -508351 -509839 -510842
250074e10842j23P87J423J643J520J260J075J067J186J279J205R36N83L56M33
$$ -510842 -510965 -510178 -508755 -507112 -505592 -504332 -503257 -502190 -501004 -499725 -498520 -497584 -497001 -496645 -496212
250059d96212Q59J496K084K353K171J597Q73K97Q7K81P26J168J377J258Q92M73
$$ -496212 -495353 -493857 -491773 -489420 -487249 -485652 -484779 -484482 -484395 -484114 -483388 -482220 -480843 -479585 -478693 -478220
250043d78220K06K03M31P52R91J051R37P61O55P09R17J188J397J466J381J204
$$ -478220 -478014 -477811 -477380 -476628 -475637 -474586 -473649 -472888 -472233 -471524 -470607 -469419 -468022 -466556 -465175 -463971
250027d63971J023R07Q60Q49Q26P74P26P42Q57J058J262J364J278J014O63L75
$$ -463971 -462948 -462041 -461181 -460332 -459506 -458732 -458006 -457264 -456407 -455349 -454087 -452723 -451445 -450431 -449768 -449393
250011d49393K86M39P65J101J276J184Q44L84j4k07j46J08M10O23O59N26L00O9
$$ -449393 -449107 -448668 -447903 -446802 -445526 -444342 -443498 -443114 -443128 -443335 -443481 -443373 -442963 -442340 -441681 -441155 -440855 -440786
249993d40786j01k08k90m01n57p25q48q59p34n00k32pJ10R9k0k07m24o41q41j005
$$ -440786 -440887 -441095 -441385 -441786 -442343 -443068 -443916 -444775 -445509 -446009 -446241 -446248 -446138 -446039 -446059 -446266 -446690 -447331 -448172 -449177
249973d49177j104j119j040q91p23o04n81o58q02r38j009j003r56r41j024j222
$$ -449177 -450281 -451400 -452440 -453331 -454054 -454658 -455239 -455897 -456699 -457637 -458646 -459649 -460605 -461546 -462570 -463792
249957d63792j485j713j806j710j447j108q00o13n55n83o15n85m83l53k61k48
$$ -463792 -465277 -466990 -468796 -470506 -471953 -473061 -473861 -474474 -475029 -475612 -476227 -476812 -477295 -477648 -477909 -478157
249941d78157l11l95m36l96l08k44k83m59p18r42r99q23m51k5K73L16R3k62n46
$$ -478157 -478468 -478863 -479299 -479695 -480003 -480247 -480530 -480989 -481707 -482649 -483648 -484471 -484922 -484947 -484674 -484358 -484265 -484527 -485073
249922d85073n69k70K49P65J017Q51K81m95j187j525j385q26o9O10R77R50N90
$$ -485073 -485642 -485912 -485663 -484898 -483881 -483030 -482749 -483244 -484431 -485956 -487341 -488167 -488236 -487626 -486649 -485699 -485109
249905d85109P2l95o51o28l57O8N24Q97J108J101Q78M78lm44p11p21m73o3L44
$$ -485109 -485037 -485432 -486083 -486711 -487068 -487000 -486476 -485579 -484471 -483370 -482492 -482014 -482017 -482461 -483172 -483893 -484366 -484429 -484085
249886d84085N86N56K80j06m07m52j92K86P75J040R33M46k59r27j306j256p94
$$ -484085 -483499 -482943 -482663 -482769 -483176 -483628 -483820 -483534 -482759 -481719 -480786 -480340 -480599 -481526 -482832 -484088 -484882
249869d84882r5N99J065J188R94O24K62N8P4K73N44P65Q47P68N80L65K10J60K15
$$ -484882 -484977 -484378 -483313 -482125 -481131 -480507 -480245 -480187 -480113 -479840 -479296 -478531 -477684 -476916 -476336 -475971 -475761 -475601 -475386
249850d75386L34M60N55O07O47P16Q40J011J167J224J096P48K31l45q09j022r15
$$ -475386 -475052 -474592 -474037 -473430 -472783 -472067 -471227 -470216 -469049 -467825 -466729 -465981 -465750 -466095 -466904 -467926 -468841
249833d68841n18K7N43Q68R23P41M31J45qkJ23K67L42L18K20J18P4J08J85K42
$$ -468841 -469359 -469332 -468789 -467921 -466998 -466257 -465826 -465681 -465689 -465691 -465568 -465301 -464959 -464641 -464421 -464303 -464229 -464121 -463936 -463694
249813d63694K30J44M2RJ11L54O63R20J012Q92O14K92O8K4J49L33M36L40L0m03
$$ -463694 -463464 -463320 -463278 -463269 -463158 -462804 -462141 -461221 -460209 -459317 -458703 -458411 -458343 -458319 -458170 -457837 -457401 -457061 -457031 -457434
249793d57434p92r74q54m61Q2N91R14R72P96M87J78j9n0Q5L37O43R37J155J251
$$ -457434 -458226 -459200 -460054 -460515 -460433 -459842 -458928 -457956 -457160 -456673 -456495 -456514 -456564 -456479 -456142 -455499 -454562 -453407 -452156
249774d52156J179R31N27M3m07p12p90o35l20K5K63L07J56j15l82n36n21l55j16
$$ -452156 -450977 -450046 -449519 -449476 -449883 -450595 -451385 -452020 -452340 -452315 -452052 -451745 -451589 -451704 -452086 -452622 -453143 -453498 -453614
249755d53614J15K79L77M51N53P05Q76R94R74P70M07k8m03o00n62l10N7M17O59
$$ -453614 -453499 -453220 -452843 -452392 -451839 -451134 -450258 -449264 -448290 -447520 -447113 -447141 -447544 -448144 -448706 -449016 -448959 -448542 -447883
249736d47883P30O52M89L25K17J75J60J20Rj69l63m88m63k47J35N86R82J198J173
$$ -447883 -447153 -446501 -446012 -445687 -445470 -445295 -445135 -445015 -445006 -445175 -445538 -446026 -446489 -446736 -446601 -446015 -445033 -443835 -442662
249717d42662R20N37J50j15j97j11N9K08K53J76K9r5j00M4L07N88P74P85O10L16
$$ -442662 -441742 -441205 -441055 -441170 -441367 -441478 -441419 -441211 -440958 -440782 -440753 -440848 -440948 -440904 -440597 -440009 -439235 -438450 -437840 -437524
249697d37524J4j85k23r9J13L31M77N28M90M05L15K38J83J50J53K13L54N80Q43
$$ -437524 -437510 -437695 -437918 -438017 -437904 -437573 -437096 -436568 -436078 -435673 -435358 -435120 -434937 -434787 -434634 -434421 -434067 -433487 -432644
249678d32644J068J159J050P50L38n1k89l01j09J76M14M84L56R8j60k85k04N6
$$ -432644 -431576 -430417 -429367 -428617 -428279 -428330 -428619 -428920 -429029 -428853 -428439 -427955 -427599 -427501 -427661 -427946 -428150 -428094
249660d28094L88O46P28O15L75J36J6P4K76N21O88O88N10K16q9l03l64k74p8J52
$$ -428094 -427706 -427060 -426332 -425717 -425342 -425206 -425190 -425116 -424840 -424319 -423631 -422943 -422433 -422217 -422306 -422609 -422973 -423247 -423325 -423173
249640d23173L53M91N54N51M94L95K74J60R0R8J93L47M95N51M50J91j64m87o36
$$ -423173 -422820 -422329 -421775 -421224 -420730 -420335 -420061 -419901 -419811 -419713 -419520 -419173 -418678 -418127 -417677 -417486 -417650 -418137 -418773
249621d18773n20j33M25R80J350J408J147O60J20k97m82m27k23mJ13P6o6k04k20
$$ -418773 -419293 -419426 -419001 -418021 -416671 -415263 -414116 -413456 -413336 -413633 -414115 -414542 -414765 -414769 -414656 -414580 -414646 -414850 -415070
249602d15070m5L03P20J056J179J034O54J62k94n82o45n00k32O2K98M46N12N32
$$ -415070 -415115 -414812 -414092 -413036 -411857 -410823 -410169 -410007 -410301 -410883 -411528 -412028 -412260 -412198 -411900 -411454 -410942 -410410
249584d10410N38N44N45N24M85M39M13M31M93N69O17N92M84L16J44K7%N2J43K14
$$ -410410 -409872 -409328 -408783 -408259 -407774 -407335 -406922 -406491 -405998 -405429 -404812 -404220 -403736 -403420 -403276 -403249 -403249 -403197 -403054 -402840
249564d02840K22J70R4N7R7K13L66M83N13M40L06J85J43K13L58N00N47M45K03
$$ -402840 -402618 -402448 -402354 -402297 -402200 -401987 -401621 -401138 -400625 -400185 -399879 -399694 -399551 -399338 -398980 -398480 -397933 -397488 -397285
249545c97285j11l90n51n55m27k34m8Q4J63K24L04M20N53O61O96O42N18L71K50
$$ -397285 -397396 -397786 -398337 -398892 -399319 -399553 -399601 -399517 -399354 -399130 -398826 -398406 -397853 -397192 -396496 -395854 -395336 -394965 -394715
249526c94715J78J51J31Q9J2p2j17q0M7K33M16N34N54M91L96L22L09L39L70L52
$$ -394715 -394537 -394386 -394255 -394166 -394154 -394226 -394343 -394423 -394376 -394143 -393727 -393193 -392639 -392148 -391752 -391430 -391121 -390782 -390412 -390060
249506c90060K58J06m5j37j38o8RJ5r3l02n40p09p25n69k86L7L03M54M77M09K89
$$ -390060 -389802 -389696 -389741 -389878 -390016 -390084 -390075 -390060 -390153 -390455 -390995 -391704 -392429 -392998 -393284 -393247 -392944 -392490 -392013 -391604 -391315
249485c91315J43l0k49n05p59r23r07o58k02L58Q57J157J178R55O13L02J44J75
$$ -391315 -391172 -391202 -391451 -391956 -392715 -393638 -394545 -395203 -395405 -395047 -394190 -393033 -391855 -390900 -390287 -389985 -389841 -389666
249467c89666L35N10N91N24L34J01q9j85k05k09k59l77n26o21n69l35M8M76Q21
$$ -389666 -389331 -388821 -388230 -387706 -387372 -387271 -387360 -387545 -387750 -387959 -388218 -388595 -389121 -389742 -390311 -390646 -390598 -390122 -389301
249448c89301R79R19O91L96J49K8N7K06M14O24P91Q93R20Q65P24N02K37k2k04
$$ -389301 -388322 -387403 -386712 -386316 -386167 -386139 -386082 -385876 -385462 -384838 -384047 -383154 -382234 -381369 -380645 -380143 -379906 -379928 -380132
249429c80132k60j80MK15L81M57M46L99L82M36N51O73P29O73N08L07J68J79L61
$$ -380132 -380392 -380572 -380568 -380353 -379972 -379515 -379069 -378670 -378288 -377852 -377301 -376628 -375899 -375226 -374718 -374411 -374243 -374064 -373703
249410c73703O66R78J175J179R86O74L70J89J97L78O60R28J088J092R44P04M54
$$ -373703 -373037 -372059 -370884 -369705 -368719 -368045 -367675 -367486 -367289 -366911 -366251 -365323 -364235 -363143 -362199 -361495 -361041
249393c61041K77K33L47N95R16J218J402J393J167P69L02r8l21l24j59O1J93J47
$$ -361041 -360764 -360531 -360184 -359589 -358673 -357455 -356053 -354660 -353493 -352724 -352422 -352520 -352841 -353165 -353324 -353263 -353070 -352923
249375c52923p5l70n82n71k90J87O87J023J066Q20M12L9j30l2K66N95P76P04M02
$$ -352923 -352998 -353368 -353950 -354521 -354811 -354624 -353937 -352914 -351848 -351028 -350616 -350577 -350707 -350739 -350473 -349878 -349102 -348398 -347996
249356c47996Jl23m52l75j92p0j34m13q10j155j281j117p10k13K03M21M39L36
$$ -347996 -347995 -348318 -348770 -349145 -349337 -349407 -349541 -349954 -350764 -351919 -353200 -354317 -355027 -355240 -355037 -354616 -354177 -353841
249338c53841K36K19K74L04J96j12n75j045j342j331j002m83K1L17L19Q0k43m69
$$ -353841 -353605 -353386 -353112 -352808 -352612 -352724 -353299 -354344 -355686 -357017 -358019 -358502 -358481 -358164 -357845 -357765 -358008 -358477
249320c58477m86l05m7J38J47j0k28l55k98p0K10L79L22M6l17n76n86l25P4L88
$$ -358477 -358963 -359268 -359315 -359177 -359030 -359040 -359268 -359623 -359921 -359991 -359781 -359402 -359080 -359034 -359351 -359927 -360513 -360838 -360764 -360376
249300c60376M25J17m16r23j138r08k86M92J103J291R81L22l90q47q63m58J71
$$ -360376 -359951 -359834 -360250 -361173 -362311 -363219 -363505 -363013 -361910 -360619 -359638 -359316 -359706 -360553 -361416 -361874 -361703
249283c61703P41J030R50N83J13k78m84n14m58m05l98m00l34j45J47M50O39O27
$$ -361703 -360962 -359932 -358982 -358399 -358286 -358564 -359048 -359562 -360020 -360425 -360823 -361223 -361557 -361702 -361555 -361105 -360466 -359839
249265c59839M21J35q0r2J18M59P72R06Q11N67L29K55M10P24J019J111Q98M27
$$ -359839 -359418 -359283 -359363 -359455 -359337 -358878 -358106 -357200 -356389 -355822 -355493 -355238 -354828 -354104 -353085 -351974 -351076 -350649
249247c50649j19n15n94l40J10N30P24O17K88p6k76k09Q0M34O58O32L64nk86l38
$$ -350649 -350768 -351283 -351877 -352217 -352107 -351577 -350853 -350236 -349948 -350024 -350300 -350509 -350429 -349995 -349337 -348705 -348341 -348346 -348632 -348970
249227c48970j35K15N29O40M85J25k88n72o23m39j17K00L95M18L02J27j8q1m6
$$ -348970 -349105 -348890 -348361 -347721 -347236 -347111 -347399 -347971 -348594 -349033 -349150 -348950 -348555 -348137 -347835 -347708 -347726 -347807 -347853
249208c47853O4K22L93N49O51O55N20K36j50n31p80p96n69j91J69L40K29j13n16
$$ -347853 -347789 -347567 -347174 -346625 -345974 -345319 -344799 -344563 -344713 -345244 -346024 -346820 -347389 -347580 -347411 -347071 -346842 -346955 -347471
249189c47471p61o83k70L38Q81J127R71M98m5l73k94J94Q90J487J716J470Q61
$$ -347471 -348232 -348915 -349185 -348847 -347966 -346839 -345868 -345370 -345415 -345788 -346082 -345888 -344998 -343511 -341795 -340325 -339464
249172c39464J59l32m32j57K86O06N68J29n60j208j518j329o89J85R92J485J559
$$ -339464 -339305 -339637 -340069 -340226 -339940 -339334 -338766 -338637 -339197 -340405 -341923 -343252 -343941 -343756 -342764 -341279 -339720
249155c39720J284Q36M15J47N3O7R9R3N5L9J00K40M06N08M81L12Q0j01j33J5K74
$$ -339720 -338436 -337600 -337185 -337038 -336985 -336918 -336819 -336726 -336671 -336632 -336532 -336292 -335886 -335378 -334897 -334585 -334505 -334606 -334739 -334724 -334450
249134c34450N24O42N75L73J57N2J32L48N81O78N61K65o4k41j38K30P06J054J070
$$ -334450 -333926 -333284 -332709 -332336 -332179 -332127 -331995 -331647 -331066 -330388 -329827 -329562 -329626 -329867 -330005 -329775 -329069 -328015 -326945
249115c26945O96N8n79r31q34l28L53Q79R90O12r3q09j202j086n10K65Q85J081
$$ -326945 -326249 -326191 -326770 -327701 -328535 -328863 -328510 -327631 -326641 -326029 -326122 -326931 -328133 -329219 -329729 -329464 -328579 -327498
249097c27498P86J74m27o92m49K28J069J719J901J540P80q7p54j028q90m83rL59
$$ -327498 -326712 -326538 -326965 -327657 -328106 -327878 -326809 -325090 -323189 -321649 -320869 -320956 -321710 -322738 -323628 -324111 -324120 -323761
249079c23761N44N81N49N18N08M83L98K49Q8RQ0L04N91P91P79N18J01k87m55k98
$$ -323761 -323217 -322636 -322087 -321569 -321061 -320578 -320180 -319931 -319843 -319834 -319754 -319450 -318859 -318068 -317289 -316771 -316670 -316957 -317412 -317710
249059c17710J32O52J018J054P30J85l36o04n07j08L95P55Q11N44Q9l45n79n35
$$ -317710 -317578 -316926 -315908 -314854 -314124 -313939 -314275 -314879 -315386 -315494 -315099 -314344 -313533 -312989 -312900 -313245 -313824 -314359
249041c14359k86L4K72L66L50L37M25O43R11J089J039P10J78l81p67q49o21k08
$$ -314359 -314645 -314611 -314339 -313973 -313623 -313286 -312861 -312218 -311307 -310218 -309179 -308469 -308291 -308672 -309439 -310288 -310909 -311117
249023c11117J98M21L80J15k47n48o84o38m70k78j40p6m6J2J43L41N49O83O80
$$ -311117 -310919 -310498 -310118 -310003 -310250 -310798 -311482 -312120 -312590 -312868 -313008 -313084 -313130 -313118 -312975 -312634 -312085 -311402 -310722
249004c10722N27K71Pj80k33j61j9J07J52Q6o6k47l84m29l62k07j3J62K77L14
$$ -310722 -310195 -309924 -309917 -310097 -310330 -310491 -310510 -310403 -310251 -310165 -310231 -310478 -310862 -311291 -311653 -311860 -311873 -311711 -311434 -311120
248984c11120K82K06J20N2J7L0R4K17M01O26Q49J003R98P76L27k77q82j302j376
$$ -311120 -310838 -310632 -310512 -310460 -310443 -310413 -310319 -310102 -309701 -309075 -308226 -307223 -306225 -305449 -305122 -305399 -306281 -307583 -308959
248965c08959j043l81M13J078J402J295Q48K79j44k28P4O21J182J507J465J076
$$ -308959 -310002 -310383 -309970 -308892 -307490 -306195 -305347 -305068 -305212 -305440 -305366 -304745 -303563 -302056 -300591 -299515
248949b99515N03m4m00n24m88m30m44n42o23n57k64K20P34J057J026O23Kn72q40
$$ -299515 -299012 -299056 -299456 -299980 -300468 -300898 -301342 -301884 -302507 -303064 -303328 -303108 -302374 -301317 -300291 -299668 -299666 -300238 -301078
248930c01078o87j81M36Q69R03N08j58q20j221j228q87l73R9L83M60M09L51L60
$$ -301078 -301765 -301946 -301510 -300641 -299738 -299230 -299388 -300208 -301429 -302657 -303544 -303917 -303818 -303435 -302975 -302566 -302215 -301855
248912c01855M16M29K99Kl85o98p67n11J1O16J065J178R10L71k24o51p61n39r5
$$ -301855 -301439 -301010 -300711 -300709 -301094 -301792 -302559 -303070 -303059 -302443 -301378 -300200 -299290 -298919 -299143 -299794 -300555 -301094 -301189
248893c01189M04P94R82R46P30L99K3l46o52q41q64o93l56P2M74P40Q10O96M73
$$ -301189 -300785 -299991 -299009 -298063 -297333 -296934 -296911 -297257 -297909 -298750 -299614 -300307 -300663 -300591 -300117 -299377 -298567 -297871 -297398
248874b97398K42P6rn2j14k27l73m75m59k89oK74M17L34L1l83p40q92p64l98Q3
$$ -297398 -297156 -297080 -297089 -297141 -297255 -297482 -297855 -298330 -298789 -299078 -299084 -298810 -298393 -298059 -298028 -298411 -299151 -300043 -300807 -301205 -301122
248853c01122N31Q28R45R12Q03O78N55M19K45M1j60k91l09k13n6R2J71J85J82
$$ -301122 -300591 -299763 -298818 -297906 -297103 -296425 -295870 -295451 -295206 -295165 -295325 -295616 -295925 -296138 -296194 -296102 -295931 -295746 -295564
248834b95564K45M18O72Q99R65P72L24k61p78j047r80o22j42K56M28L57J48k4
$$ -295564 -295319 -294901 -294229 -293330 -292365 -291593 -291269 -291530 -292308 -293355 -294335 -294957 -295099 -294843 -294415 -294058 -293910 -293934
248816b93934oK45O54J055J276J214Q87M04p9m41o24o44n65m38k94j35M6K27L63
$$ -293934 -293940 -293695 -293041 -291986 -290710 -289496 -288609 -288205 -288284 -288725 -289349 -289993 -290558 -290996 -291290 -291425 -291379 -291152 -290789
248797b90789M02L14J24j04k74l29k66j43m8l8j10j97j98m6K50O09Q98J009R20
$$ -290789 -290387 -290073 -289949 -290053 -290327 -290656 -290922 -291065 -291113 -291151 -291261 -291458 -291656 -291702 -291452 -290843 -289945 -288936 -288016
248778b88016O86M36K80K68L46M13L66J75q2k64k33P2N75J101J448J477J184O95
$$ -288016 -287330 -286894 -286614 -286346 -286000 -285587 -285221 -285046 -285128 -285392 -285625 -285553 -284978 -283877 -282429 -280952 -279768 -279073
248760b79073K15p3q2J43M63P21Q10P26N28L13J40J1F69989o77n14j36K82N82
$$ -279073 -278858 -278931 -279013 -278870 -278407 -277686 -276876 -276150 -275622 -275309 -275169 -275158 669989 669312 668798 668662 668944 669526
248742F69526O84N84L50P3j80l58m47m39l32j34J33M19O47P51O88M73J80r1k40
$$ 669526 670210 670794 671144 671217 671037 670679 670232 669793 669461 669327 669460 669879 670526 671277 671965 672438 672618 672527 672287
248723F72287k24o0J79L98N26N39M77L92L48L59M12M62M77M48M02L80M16N02O05
$$ 672287 672063 672003 672182 672580 673106 673645 674122 674514 674862 675221 675633 676095 676572 677020 677422 677802 678218 678720 679325
248704F79325O69O52N44L82K25J28J21J89L03M24N39O48P64Q83R65R59Q21N48
$$ 679325 679994 680646 681190 681572 681797 681925 682046 682235 682538 682962 683501 684149 684913 685796 686761 687720 688541 689089
248686F89089K10p6j88n4K91P15J029J071P84K56l04o58o27j79N55J336J904K096
$$ 689089 689299 689223 689035 688981 689272 689987 691016 692087 692871 693127 692823 692165 691538 691359 691914 693250 695154 697250
248668F97250J893J410Q48L86J30O5J08J52J39P8L2P5K36M76P10Q40Q15O55M44
$$ 697250 699143 700553 701401 701787 701917 701982 702090 702242 702381 702459 702491 702566 702802 703278 703988 704828 705643 706298 706742
248649G06742K84K48L39M90O02N92M46K21L4pJ65N19R49J306J460J352J015N64
$$ 706742 707026 707274 707613 708103 708705 709297 709743 709964 709998 709991 710156 710675 711624 712930 714390 715742 716757 717321
248631G17321J47j04j30M7L31N92P22O67M54J75n3j26pK76O26R21J057R86P31
$$ 717321 717468 717364 717234 717281 717612 718204 718926 719593 720047 720222 720169 720043 720036 720312 720938 721859 722916 723902 724633
248612G24633L76K8k18l09k41n1K10M98P72J005J161J198J076P86L60j06m80o37
$$ 724633 725009 725037 724819 724510 724269 724218 724428 724926 725698 726703 727864 729062 730138 730924 731284 731178 730698 730061
248594G30061n00r4M81J052J459J599J468J148P62M31K12J09P4O0M4L8P7J76L13
$$ 730061 729561 729467 729948 731000 732459 734058 735526 736674 737436 737867 738079 738188 738262 738322 738366 738404 738481 738657 738970
248575G38970M39M82M16K62R4RO4K47M78O33O21M36J60n5p0J71O15J097J424J463
$$ 738970 739409 739891 740307 740569 740663 740672 740736 740983 741461 742094 742715 743151 743311 743256 743186 743357 743972 745069 746493 747956
248555G47956J191P15K29r1j38O5M04P26R21R55Q81P94P52P60P52O39L63n4n08
$$ 747956 749147 749862 750091 750000 749862 749927 750331 751057 751978 752933 753814 754608 755360 756120 756872 757511 757874 757820 757312
248536G57312q49r53p72l61J41N68P97P85N84L08P9pP4K97N92Q75J078J154J081
$$ 757312 756463 755510 754738 754377 754518 755086 755883 756668 757252 757560 757639 757632 757706 758003 758595 759470 760548 761702 762783
248517G62783Q69N59K14p8k42k24k8K83O16Q64R55Q84O99M91L35K70K79L05K93
$$ 762783 763652 764211 764425 764347 764105 763881 763853 764136 764752 765616 766571 767455 768154 768645 768980 769250 769529 769834 770127
248498G70127K17J03J3J4J42L71O29Q32R13Q55P08N34M03L31L01K57J63J3j45
$$ 770127 770344 770447 770460 770474 770616 770987 771616 772448 773361 774216 774924 775458 775861 776192 776493 776750 776913 776926 776781
248479G76781k40k07k9K54N53P74Q57Q00O68N49N15N92P46Q98R77R35P80N61L45
$$ 776781 776541 776334 776305 776559 777112 777886 778743 779543 780211 780760 781275 781867 782613 783511 784488 785423 786203 786764 787109
248460G87109J74O0k0r7j79k44k31p2K59P36J266J709J939J887J564J070N57J79
$$ 787109 787283 787343 787323 787226 787047 786803 786572 786500 786759 787495 788761 790470 792409 794296 795860 796930 797487 797666
248442G97666L6J47M46Q20J140J317J323J191R93Q07O92O62O93P37P41O68N13
$$ 797666 797702 797849 798295 799115 800255 801572 802895 804086 805079 805886 806578 807240 807933 808670 809411 810079 810592
248425H10592K98P6r2j48n4J88N37R11J208J336J245R57N55J79m4k4K25O05R56
$$ 810592 810890 810966 810874 810726 810672 810860 811397 812308 813516 814852 816097 817054 817609 817788 817744 817720 817945 818550 819506
248406H19506J123J027O99K76n3j32R4N48J044J372J377J047N01m4l81l95j14
$$ 819506 820629 821656 822355 822631 822578 822446 822540 823088 824132 825504 826881 827928 828429 828385 828004 827609 827495
248389H27495L07O68Q06O75L59K4j66j36P2L17M47L67J08j87l38k08K05P70J256
$$ 827495 827802 828470 829276 829951 830310 830334 830168 830032 830104 830421 830868 831235 831343 831156 830818 830610 830815 831585 832841
248370H32841J445J224O40j10p65j104j040o49j29K91M55L40N2k19l07j37K35
$$ 832841 834286 835510 836150 836040 835275 834171 833131 832482 832353 832644 833099 833439 833491 833272 832965 832828 833063
248353H33063O58R53R99P96M48J36J4J57N11R29J224J258J002N41M2l20m33k92
$$ 833063 833721 834674 835673 836469 836917 837053 837067 837224 837735 838664 839888 841146 842148 842689 842731 842411 841978 841686
248335H41686ML04M78M69L22J50Q8K14N23R21J264J428J355J075O95L30P7m1n6
$$ 841686 841690 841994 842472 842941 843263 843413 843501 843715 844238 845159 846423 847851 849206 850281 850976 851306 851383 851342 851286
248316H51286l6m2q7j40j43n6J26L59N67O78O56N18L06Q3j05k39l16l45l20k39
$$ 851286 851250 851208 851121 850981 850838 850782 850908 851267 851834 852512 853168 853686 853992 854075 853970 853731 853415 853070 852750 852511
248296H52511r6Q5K53L51L39K33J11Q1K29N67R96J333J393J068M02m03j053j292
$$ 852511 852415 852500 852753 853104 853443 853676 853787 853868 854097 854664 855660 856993 858386 859454 859856 859453 858400 857108
248278H57108j003k66O54J442J838J759J318P53L21J66K81N17O90O83M99K63J26
$$ 857108 856105 855839 856493 857935 859773 861532 862850 863603 863924 864090 864371 864888 865578 866261 866760 867023 867149
248261H67149J84M10O68P91O79L75M7r0J09O28J278J780J899J563R11K34j60r7
$$ 867149 867333 867743 868411 869202 869881 870256 870303 870213 870322 870950 872228 874008 875907 877470 878381 878615 878455 878358
248243H78358L84J049J578J726J435Q56K74l9M3M51R62J316J347J066O44L14K58
$$ 878358 878742 879791 881369 883095 884530 885386 885660 885621 885664 886115 887077 888393 889740 890806 891450 891764 892022
248226H92022N11R52J373J584J501J190Q10N38M82O41R29J234J491J695J892K129
$$ 892022 892533 893485 894858 896442 897943 899133 899943 900481 900963 901604 902533 903767 905258 906953 908845 910974
248210I10974K383K567K546K226J606Q19Q2l70l89K5P23J474K032K256K119J718
$$ 910974 913357 915924 918470 920696 922302 923121 923203 922833 922444 922469 923192 924666 926698 928954 931073 932791
248194I32791J213P67M83L97M76O47Q31R56R83Q98P34N52M42M75O84J021J375
$$ 932791 934004 934771 935254 935651 936127 936774 937605 938561 939544 940442 941176 941728 942170 942645 943329 944350 945725
248177I45725J592J553J220O81J16k72l43r6L27P14Q69P26L74K4r1J43O83J305
$$ 945725 947317 948870 950090 950771 950887 950615 950272 950176 950503 951217 952086 952812 953186 953210 953119 953262 953945 955250
248159I55250J734J749J316O04r6m80l94J10Q01J366J569J341Q11K18j94k94j05
$$ 955250 956984 958733 960049 960653 960557 960077 959683 959793 960594 961960 963529 964870 965681 965899 965705 965411 965306
248142I65306K24N12O44O19N34N16O37Q67J092J172J022O64K20j48l05k28K1L08
$$ 965306 965530 966042 966686 967305 967839 968355 968992 969859 970951 972123 973145 973809 974029 973881 973576 973348 973369 973677
248124I73677N15N84N49M89M79N39O25O56N69L73J53L6J23M38Q98J342J607J582
$$ 973677 974192 974776 975325 975814 976293 976832 977457 978113 978682 979055 979208 979244 979367 979805 980703 982045 983652 985234
248106I85234J278P98L10l2j48m2K13N12P69R40J023J033R94R14Q09O91N93N47
$$ 985234 986512 987310 987620 987588 987440 987398 987611 988123 988892 989832 990855 991888 992882 993796 994605 995296 995889 996436
248088I96436N69O51P51Q12Q03P24O20N64O02P43R27J069J085R52P16M79L51L96
$$ 996436 997005 997656 998407 999219 1000022 1000746 1001366 1001930 1002532 1003275 1004202 1005271 1006356 1007308 1008024 1008503 1008854 1009250
248070A009250O04Q90J139J269J251J136R96R03Q59Q23P22N21K45jr0P0M67R81
$$ 1009250 1009854 1010744 1011883 1013152 1014403 1015539 1016535 1017438 1018297 1019120 1019842 1020363 1020608 1020607 1020517 1020587 1021054 1022035
248052A022035J416J588J404R13K89k33m61l28R8O31J067J257J173R04N99L98
$$ 1022035 1023451 1025039 1026443 1027356 1027645 1027412 1026951 1026623 1026721 1027352 1028419 1029676 1030849 1031753 1032352 1032750
248036A032750L87N40P82J004J127J128J040R17Q13P49P19O95O55N98N37N00N15
$$ 1032750 1033137 1033677 1034459 1035463 1036590 1037718 1038758 1039675 1040488 1041237 1041956 1042651 1043306 1043904 1044441 1044941 1045456
248019A045456N99P46R43J167J382J546J619J565J375J067P11M00K24K52M88Q76
$$ 1045456 1046055 1046801 1047744 1048911 1050293 1051839 1053458 1055023 1056398 1057465 1058176 1058576 1058800 1059052 1059540 1060416
248003A060416J310J673J869J860J657J325R41N82K99J28Q2J67L72O71J009J313
$$ 1060416 1061726 1063399 1065268 1067128 1068785 1070110 1071051 1071633 1071932 1072060 1072142 1072309 1072681 1073352 1074361 1075674
247987A075674J503J520J356J051O97L99K31K23L35M83N72N35L62J04j47k90k50
$$ 1075674 1077177 1078697 1080053 1081104 1081801 1082200 1082431 1082654 1082989 1083472 1084044 1084579 1084941 1085045 1084898 1084608 1084358
247970A084358j1L92Q74J329J663J817J778J591J326J070Q82P91P77P86P55O56
$$ 1084358 1084347 1084739 1085613 1086942 1088605 1090422 1092200 1093791 1095117 1096187 1097069 1097860 1098637 1099423 1100178 1100834
247954A100834M97L34K50L07N24Q43J148J318J254R45M65l6m01n08l24R2O11J089
$$ 1100834 1101331 1101665 1101915 1102222 1102746 1103589 1104737 1106055 1107309 1108254 1108719 1108683 1108282 1107774 1107450 1107542 1108153 1109242
247936A109242J404J501J385J122P93M75K32J00R4K09M16O67Q98J046J074R78
$$ 1109242 1110646 1112147 1113532 1114654 1115447 1115922 1116154 1116254 1116348 1116557 1116973 1117640 1118538 1119584 1120658 1121636
247920A121636Q10O37N37N55O86Q78J069J201J261J278J299J365J474J585J632
$$ 1121636 1122446 1123083 1123620 1124175 1124861 1125739 1126808 1128009 1129270 1130548 1131847 1133212 1134686 1136271 1137903
247905A137903J565J376J122Q99P91Q52J049J300J483J514J366J095Q07O25O21
$$ 1137903 1139468 1140844 1141966 1142865 1143656 1144508 1145557 1146857 1148340 1149854 1151220 1152315 1153122 1153747 1154368
247890A154368Q05J109J432J664J737J639J411J129Q71P04O59P38R12J139J355
$$ 1154368 1155173 1156282 1157714 1159378 1161115 1162754 1164165 1165294 1166165 1166869 1167528 1168266 1169178 1170317 1171672
247875A171672J512J574J534J414J265J134J064J058J088J107J076R84Q53P41
$$ 1171672 1173184 1174758 1176292 1177706 1178971 1180105 1181169 1182227 1183315 1184422 1185498 1186482 1187335 1188076
247861A188076P03P66R06J066J160J133R75P40N31M44N48Q37J237J625J871J880
$$ 1188076 1188779 1189545 1190451 1191517 1192677 1193810 1194785 1195525 1196056 1196500 1197048 1197885 1199122 1200747 1202618 1204498
247845A204498J623J145N48k7m46o16m92j12M35J021J506J797J850J701J439J172
$$ 1204498 1206121 1207266 1207814 1207787 1207341 1206725 1206233 1206121 1206556 1207577 1209083 1210880 1212730 1214431 1215870 1217042
247829A217042R90R31R64J017J013R04P05M77L11K75L89O10Q53J033J095J036
$$ 1217042 1218032 1218963 1219927 1220944 1221957 1222861 1223566 1224043 1224354 1224629 1225018 1225628 1226481 1227514 1228609 1229645
247813A229645R11P92P50Q13R73J185J391J536J588J526J359J105Q04N15L08K40
$$ 1229645 1230556 1231348 1232098 1232911 1233884 1235069 1236460 1237996 1239584 1241110 1242469 1243574 1244378 1244893 1245201 1245441
247797A245441L38N83R05J207J402J446J363J222J115J104J190J324J421J424
$$ 1245441 1245779 1246362 1247267 1248474 1249876 1251322 1252685 1253907 1255022 1256126 1257316 1258640 1260061 1261485
247783A261485J321J166J038J002J056J139J148J009P24L98J93K67O88J383K146
$$ 1261485 1262806 1263972 1265010 1266012 1267068 1268207 1269355 1270364 1271088 1271486 1271679 1271946 1272634 1274017 1276163
247768A276163K729K919K636J972J143M15ql9K61P43J240J618J837J916J908J851
$$ 1276163 1278892 1281811 1284447 1286419 1287562 1287977 1287969 1287930 1288191 1288934 1290174 1291792 1293629 1295545 1297453 1299304
247752A299304J760J617J413J169R38P90P78R09J131J359J505J523J418J251J100
$$ 1299304 1301064 1302681 1304094 1305263 1306201 1306991 1307769 1308678 1309809 1311168 1312673 1314196 1315614 1316865 1317965
247737A317965J036J088J246J465J685J851J927J884J724J462J148Q48O44N98
$$ 1317965 1319001 1320089 1321335 1322800 1324485 1326336 1328263 1330147 1331871 1333333 1334481 1335329 1335973 1336571
247723A336571P32J006J332J596J707J641J439J205J037R99J081J203J267J202
$$ 1336571 1337303 1338309 1339641 1341237 1342944 1344585 1346024 1347229 1348266 1349265 1350346 1351549 1352816 1354018
247709A354018J004P49N42M87O15Q95J233J528J720J798J812J808J819J826J787
$$ 1354018 1355022 1355771 1356313 1356800 1357415 1358310 1359543 1361071 1362791 1364589 1366401 1368209 1370028 1371854 1373641
247694A373641J659J443J194J007R63J095J365J669J885J928J789J518J217R78
$$ 1373641 1375300 1376743 1377937 1378944 1379907 1381002 1382367 1384036 1385921 1387849 1389638 1391156 1392373 1393351
247680A393351Q53Q47R31J075J270J519J821K138K389K473K316J915J374Q63N68
$$ 1393351 1394204 1395051 1395982 1397057 1398327 1399846 1401667 1403805 1406194 1408667 1410983 1412898 1414272 1415135 1415703
247665A415703O07R77J544K109K473K537K323J972J658J516J581J787K007K123
$$ 1415703 1416310 1417287 1418831 1420940 1423413 1425950 1428273 1430245 1431903 1433419 1435000 1436787 1438794 1440917
247651A440917K083J922J735J620J632J752J908K012K007J888J707J534J431J427
$$ 1440917 1443000 1444922 1446657 1448277 1449909 1451661 1453569 1455581 1457588 1459476 1461183 1462717 1464148 1465575
247637A465575J520J689J908K157K406K610K697K603K292J807J269Q49P13R42
$$ 1465575 1467095 1468784 1470692 1472849 1475255 1477865 1480562 1483165 1485457 1487264 1488533 1489382 1490095 1491037
247623A491037J477K128K638K778K445J719Q38J10j94M3P55J718K638L265L478
$$ 1491037 1492514 1494642 1497280 1500058 1502503 1504222 1505060 1505170 1504976 1505019 1505774 1507492 1510130 1513395 1516873
247608A516873L294K863K368J969J740J677J711J784J861J957K115K371K720L102
$$ 1516873 1520167 1523030 1525398 1527367 1529107 1530784 1532495 1534279 1536140 1538097 1540212 1542583 1545303 1548405
247594A548405L424L586L527L260K867K481K239K230K467K874L314L642L755L632
$$ 1548405 1551829 1555415 1558942 1562202 1565069 1567550 1569789 1572019 1574486 1577360 1580674 1584316 1588071 1591703
247580A591703L347L033K827K825L024L344L655L840L857L747L620L601L744M013
$$ 1591703 1595050 1598083 1600910 1603735 1606759 1610103 1613758 1617598 1621455 1625202 1628822 1632423 1636167 1640180
247566A640180M275M370M175L683L018K393K026K045K426L010L558L857L802L442
$$ 1640180 1644455 1648825 1653000 1656683 1659701 1662094 1664120 1666165 1668591 1671601 1675159 1679016 1682818 1686260
247552A686260K933K486K248K268K479K748K944L000K929K797K677K599K540K433
$$ 1686260 1689193 1691679 1693927 1696195 1698674 1701422 1704366 1707366 1710295 1713092 1715769 1718368 1720908 1723341
247538A723341K238J950J635J389J291J360J538J707J756J624J336R97P40O64
$$ 1723341 1725579 1727529 1729164 1730553 1731844 1733204 1734742 1736449 1738205 1739829 1741165 1742162 1742902 1743566
247524A743566Q02J110J492J855K131K307K395K411K351K207J970J681J417J295
$$ 1743566 1744368 1745478 1746970 1748825 1750956 1753263 1755658 1758069 1760420 1762627 1764597 1766278 1767695 1768990
247510A768990J393J720K179K601K796K657K193J562R86O76P34J107J626K076
$$ 1768990 1770383 1772103 1774282 1776883 1779679 1782336 1784529 1786091 1787077 1787753 1788487 1789594 1791220 1793296
247496A793296K299K267K080J905J895K093K431K753K897K785K454K033J677J487
$$ 1793296 1795595 1797862 1799942 1801847 1803742 1805835 1808266 1811019 1813916 1816701 1819155 1821188 1822865 1824352
247482A824352J459J500J483J320J021O88M70M81P39J156J567J817J823J608J281
$$ 1824352 1825811 1827311 1828794 1830114 1831135 1831823 1832293 1832774 1833513 1834669 1836236 1838053 1839876 1841484 1842765
247467A842765R88Q33Q51J000J195J374J505J610J717J838J942J979J900J708
$$ 1842765 1843753 1844586 1845437 1846437 1847632 1849006 1850511 1852121 1853838 1855676 1857618 1859597 1861497 1863205
247453A863205J464J272J224J363J649J982K246K367K342K237K130K072K046J986
$$ 1863205 1864669 1865941 1867165 1868528 1870177 1872159 1874405 1876772 1879114 1881351 1883481 1885553 1887599 1889585
247439A889585J823J540J212R81J000J343J950K639L168L341L103K565J960J540
$$ 1889585 1891408 1892948 1894160 1895141 1896141 1897484 1899434 1902073 1905241 1908582 1911685 1914250 1916210 1917750
247425A917750J462J723K167K570K748K651K373K104K024K207K586K977L173L052
$$ 1917750 1919212 1920935 1923102 1925672 1928420 1931071 1933444 1935548 1937572 1939779 1942365 1945342 1948515 1951567
247411A951567K623K039J520J256J333J696K189K625K865K861K656K361K085J912
$$ 1951567 1954190 1956229 1957749 1959005 1960338 1962034 1964223 1966848 1969713 1972574 1975230 1977591 1979676 1981588
247397A981588J875J965K154K406K679K934L120L197L145K982K762K557K429K403
$$ 1981588 1983463 1985428 1987582 1989988 1992667 1995601 1998721 2001918 2005063 2008045 2010807 2013364 2015793 2018196
247383B018196K460K541K592K589K545K504K503K540K577K543K399K155J898J753
$$ 2018196 2020656 2023197 2025789 2028378 2030923 2033427 2035930 2038470 2041047 2043590 2045989 2048144 2050042 2051795
247369B051795J819K118K567L002L258L237K978K631K399K429K747L221L634L777
$$ 2051795 2053614 2055732 2058299 2061301 2064559 2067796 2070774 2073405 2075804 2078233 2080980 2084201 2087835 2091612
247355B091612L553L034K432J994J911K203K741L290L634L675L459L157K961K998
$$ 2091612 2095165 2098199 2100631 2102625 2104536 2106739 2109480 2112770 2116404 2120079 2123538 2126695 2129656 2132654
247341B132654L251L602L873L938L773L478L211L113L232L509L805L985L984L840
$$ 2132654 2135905 2139507 2143380 2147318 2151091 2154569 2157780 2160893 2164125 2167634 2171439 2175424 2179408 2183248
247327B183248L674L618L750M042M373M582M551M253L785L317L026L025L314L792
$$ 2183248 2186922 2190540 2194290 2198332 2202705 2207287 2211838 2216091 2219876 2223193 2226219 2229244 2232558 2236350
247313B236350M295M673M832M775M574M340M158M068M047M030L952L780L524L253
$$ 2236350 2240645 2245318 2250150 2254925 2259499 2263839 2267997 2272065 2276112 2280142 2284094 2287874 2291398 2294651
247299B294651L049K991L111L395L773M154M450M605M606M483M292M089L919L799
$$ 2294651 2297700 2300691 2303802 2307197 2310970 2315124 2319574 2324179 2328785 2333268 2337560 2341649 2345568 2349367
247285B349367L738L728L770L860M000M170M336M448M455M335M104L826L581L453
$$ 2349367 2353105 2356833 2360603 2364463 2368463 2372633 2376969 2381417 2385872 2390207 2394311 2398137 2401718 2405171
247271B405171L479L650L904M158M340M417M409M364M335M358M417M475M482M406
$$ 2405171 2408650 2412300 2416204 2420362 2424702 2429119 2433528 2437892 2442227 2446585 2451002 2455477 2459959 2464365
247257B464365M249M046L850L697L606L567L556L566L597L678L825M040M281M481
$$ 2464365 2468614 2472660 2476510 2480207 2483813 2487380 2490936 2494502 2498099 2501777 2505602 2509642 2513923 2518404
247243B518404M567M498M287M004L765L674L799M132M596N070N419N550N421N065
$$ 2518404 2522971 2527469 2531756 2535760 2539525 2543199 2546998 2551130 2555726 2560796 2566215 2571765 2577186 2582251
247229B582251M565M036L600L352L348L583M003M503M957N249N310N147M836M512
$$ 2582251 2586816 2590852 2594452 2597804 2601152 2604735 2608738 2613241 2618198 2623447 2628757 2633904 2638740 2643252
247215B643252M311M329M588N016N491N870O058O031N842N602N413N347N406N543
$$ 2643252 2647563 2651892 2656480 2661496 2666987 2672857 2678915 2684946 2690788 2696390 2701803 2707150 2712556 2718099
247201B718099N676N739N700N575N406N246N133N068N042N027N010M983M952M916
$$ 2718099 2723775 2729514 2735214 2740789 2746195 2751441 2756574 2761642 2766684 2771711 2776721 2781704 2786656 2791572
247187B791572M861M767M613M401M163L959L858L910M110M400M679M838M804M563
$$ 2791572 2796433 2801200 2805813 2810214 2814377 2818336 2822194 2826104 2830214 2834614 2839293 2844131 2848935 2853498
247173B853498M182L757L406L200L159L242L381L516L622L703L797L923M075M208
$$ 2853498 2857680 2861437 2864843 2868043 2871202 2874444 2877825 2881341 2884963 2888666 2892463 2896386 2900461 2904669
247159B904669M263M198M009L753L511L364L346L429L540L589L539L417L309L335
$$ 2904669 2908932 2913130 2917139 2920892 2924403 2927767 2931113 2934542 2938082 2941671 2945210 2948627 2951936 2955271
247145B955271L574M021M578N084N377N363N056M576M096L778L722L926M317M779
$$ 2955271 2958845 2962866 2967444 2972528 2977905 2983268 2988324 2992900 2996996 3000774 3004496 3008422 3012739 3017518
247131C017518N208N534N716N739N602N305M890M437M070L930M114M613N309N974
$$ 3017518 3022726 3028260 3033976 3039715 3045317 3050622 3055512 3059949 3064019 3067949 3072063 3076676 3081985 3087959
247117C087959O385O389N989N355M745M412M477M887N440N879O012N797N352M892
$$ 3087959 3094344 3100733 3106722 3112077 3116822 3121234 3125711 3130598 3136038 3141917 3147929 3153726 3159078 3163970
247103C163970M614M610M827N118N323N363N274N180N203N387N643N809N724N336
$$ 3163970 3168584 3173194 3178021 3183139 3188462 3193825 3199099 3204279 3209482 3214869 3220512 3226321 3232045 3237381
247089C237381M740M160L832L886M277M775N091M991M438L591K758K233K176K526
$$ 3237381 3242121 3246281 3250113 3253999 3258276 3263051 3268142 3273133 3277571 3281162 3283920 3286153 3288329 3290855
247075C290855L054L462L543L265K777K325K120K219K514K787K820K522J967J363
$$ 3290855 3293909 3297371 3300914 3304179 3306956 3309281 3311401 3313620 3316134 3318921 3321741 3324263 3326230 3327593
247061C327593R52Q87J161J627K061K286K241K010J774J707J907K335K855L286
$$ 3327593 3328545 3329432 3330593 3332220 3334281 3336567 3338808 3340818 3342592 3344299 3346206 3348541 3351396 3354682
247047C354682L488L418L133K760K445K293K348K592K964L384L773M065M212M198
$$ 3354682 3358170 3361588 3364721 3367481 3369926 3372219 3374567 3377159 3380123 3383507 3387280 3391345 3395557 3399755
247033C399755M041L808L587L480L550L810M196M607M934N103N124N065N034N121
$$ 3399755 3403796 3407604 3411191 3414671 3418221 3422031 3426227 3430834 3435768 3440871 3445995 3451060 3456094 3461215
247019C461215N359N699O045O277O331O208N998N827N822O039O464O981P447P730
$$ 3461215 3466574 3472273 3478318 3484595 3490926 3497134 3503132 3508959 3514781 3520820 3527284 3534265 3541712 3549442
247005C549442P758P552P222O914O763O844P125P507P837P997P938P720P467P344
$$ 3549442 3557200 3564752 3571974 3578888 3585651 3592495 3599620 3607127 3614964 3622961 3630899 3638619 3646086 3653430
246991C653430P453P803Q301Q784R096R168R031Q826Q710Q802R104R507R845R967
$$ 3653430 3660883 3668686 3676987 3685771 3694867 3704035 3713066 3721892 3730602 3739404 3748508 3758015 3767860 3777827
246977C777827R828R513R194R063R237R702J0329J0926J1338J1495J1451J1322
$$ 3777827 3787655 3797168 3806362 3815425 3824662 3834364 3844693 3855619 3866957 3878452 3889903 3901225
246965C901225J1228J1219J1265J1276J1168J0921J0597J0323J0220J0348J0682
$$ 3901225 3912453 3923672 3934937 3946213 3957381 3968302 3978899 3989222 3999442 4009790 4020472
246954D020472J1122J1543J1866J2072J2206J2325J2458J2578J2625J2538J2313
$$ 4020472 4031594 4043137 4055003 4067075 4079281 4091606 4104064 4116642 4129267 4141805 4154118
246943D154118J2010J1741J1607J1646J1825J2038J2191J2235J2217J2240J2417
$$ 4154118 4166128 4177869 4189476 4201122 4212947 4224985 4237176 4249411 4261628 4273868 4286285
246932D286285J2789J3307J3823J4180J4272J4112J3813J3549J3461J3587J3864
$$ 4286285 4299074 4312381 4326204 4340384 4354656 4368768 4382581 4396130 4409591 4423178 4437042
246921D437042J4145J4300J4264J4086J3878J3779J3863J4126J4482J4820J5060
$$ 4437042 4451187 4465487 4479751 4493837 4507715 4521494 4535357 4549483 4563965 4578785 4593845
246910D593845J5184J5236J5282J5371J5510J5673J5830J5972J6128J6342J6643
$$ 4593845 4609029 4624265 4639547 4654918 4670428 4686101 4701931 4717903 4734031 4750373 4767016
246899D767016J7017J7402J7716J7905J7964J7946J7930J7969J8062J8149J8153
$$ 4767016 4784033 4801435 4819151 4837056 4855020 4872966 4890896 4908865 4926927 4945076 4963229
246888D963229J8027J7800J7571J7459J7550J7830J8201J8507J8634J8552J8352
$$ 4963229 4981256 4999056 5016627 5034086 5051636 5069466 5087667 5106174 5124808 5143360 5161712
246877E161712J8194J8231J8531J9050J9641K0147K0460K0581K0599K0630K0755
$$ 5161712 5179906 5198137 5216668 5235718 5255359 5275506 5295966 5316547 5337146 5357776 5378531
246866E378531K0973K1216K1399K1491K1537K1648K1931K2418K3036K3629K4025
$$ 5378531 5399504 5420720 5442119 5463610 5485147 5506795 5528726 5551144 5574180 5597809 5621834
246855E621834K4142K4026K3845K3809K4075K4665K5461K6261K6871K7196K7267
$$ 5621834 5645976 5670002 5693847 5717656 5741731 5766396 5791857 5818118 5844989 5872185 5899452
246844E899452K7207K7162K7225K7404K7649K7896K8133K8401K8782K9316K9979
$$ 5899452 5926659 5953821 5981046 6008450 6036099 6063995 6092128 6120529 6149311 6178627 6208606
246833F208606L0665L1229L1574L1683L1661L1653L1796L2129L2593L3061L3430
$$ 6208606 6239271 6270500 6302074 6333757 6365418 6397071 6428867 6460996 6493589 6526650 6560080
246822F560080L3679L3896L4217L4758L5509L6334L6999L7307L7179L6738L6239
$$ 6560080 6593759 6627655 6661872 6696630 6732139 6768473 6805472 6842779 6879958 6916696 6952935
246811F952935L6004L6250L7018L8154L9380M0416M1098M1430M1555M1677M1961
$$ 6952935 6988939 7025189 7062207 7100361 7139741 7180157 7221255 7262685 7304240 7345917 7387878
246800G387878M2469M3149M3884M4552M5080M5465M5770M6083M6491M7055M7814
$$ 7387878 7430347 7473496 7517380 7561932 7607012 7652477 7698247 7744330 7790821 7837876 7885690
246789G885690M8759M9841N0972N2018N2861N3425N3733N3916N4182N4733N5688
$$ 7885690 7934449 7984290 8035262 8087280 8140141 8193566 8247299 8301215 8355397 8410130 8465818
246778H465818N7017N8547O0034O1265O2157O2786O3343O4039O5003O6225O7575
$$ 8465818 8522835 8581382 8641416 8702681 8764838 8827624 8890967 8955006 9020009 9086234 9153809
246767I153809O8894P0078P1144P2211P3421P4852P6463P8111P9643Q0994Q2238
$$ 9153809 9222703 9292781 9363925 9436136 9509557 9584409 9660872 9738983 9818626 9899620 9981858
246756I981858Q3575Q5224Q7294Q9700R2181R4405R6122R7300R8145R9027J00309
$$ 9981858 10065433 10150657 10237951 10327651 10419832 10514237 10610359 10707659 10805804 10904831 11005140
246745A1005140J02191J04626J07364J10081J12530J14660J16619J18658J20999
$$ 11005140 11107331 11211957 11319321 11429402 11541932 11656592 11773211 11891869 12012868
246736A2012868J23726J26758J29908J32990J35925J38769J41675J44804J48238
$$ 12012868 12136594 12263352 12393260 12526250 12662175 12800944 12942619 13087423 13235661
246727A3235661J51949J55824J59731J63592J67414J71264J75219J79319J83548
$$ 13235661 13387610 13543434 13703165 13866757 14034171 14205435 14380654 14559973 14743521
246718A4743521J87871J92271J96793K01531K06586K12005K17736K23647K29578
$$ 14743521 14931392 15123663 15320456 15521987 15728573 15940578 16158314 16381961 16611539
246709A6611539K35433K41223K47079K53187K59719K66731K74172K81899K89768
$$ 16611539 16846972 17088195 17335274 17588461 17848180 18114911 18389083 18670982 18960750
246700A8960750K97702L05731L13971L22568L31630L41199L51240L61684L72473
$$ 18960750 19258452 19564183 19878154 20200722 20532352 20873551 21224791 21586475 21958948
246691B1958948L83572L94977M06686M18691M30980M43547M56438M69733M83537
$$ 21958948 22342520 22737497 23144183 23562874 23993854 24437401 24893839 25363572 25847109
246682B5847109M97922N12896N28387N44288N60515N77062N94032O11593O29900
$$ 25847109 26345031 26857927 27386314 27930602 28491117 29068179 29662211 30273804 30903704
246673C0903704O49028O68932O89492P10590P32209P54462P77576Q01781Q27216
$$ 30903704 31552732 32221664 32911156 33621746 34353955 35108417 35885993 36687774 37514990
246664C7514990Q53842Q81483R09901R38941R68608R99094J030692J063681J098215
$$ 37514990 38368832 39250315 40160216 41099157 42067765 43066859 44097551 45161232 46259447
246655D6259447J134289J171782J210566J250584J291902J334651J378965J424889
$$ 46259447 47393736 48565518 49776084 51026668 52318570 53653221 55032186 56457075
246647E6457075J472365J521275J571545J623195J676374J731282J788084J846812
$$ 56457075 57929440 59450715 61022260 62645455 64321829 66053111 67841195 69688007
246639F9688007J907364J969569K033292K098547K165498K234406K305502K378879
$$ 69688007 71595371 73564940 75598232 77696779 79862277 82096683 84402185 86781064
246631H6781064K454468K532113K611679K693196K776869K863010K951890L043587
$$ 86781064 89235532 91767645 94379324 97072520 99849389 102712399 105664289 108707876
246623A08707876L137935L234587L333170L433454L535444L639334L745360L853626
$$ 108707876 111845811 115080398 118413568 121847022 125382466 129021800 132767160 136620786
246615A36620786L963971M075991M189162M303014M417265M531843M646787M762090
$$ 136620786 140584757 144660748 148849910 153152924 157570189 162102032 166748819 171510909
246607A71510909M877574M992874N107514N221051N333190N443787N552758N659928
$$ 171510909 176388483 181381357 186488871 191709922 197043112 202486899 208039657 213699585
246599B13699585N764897N867036N965559O059677O148729O232203O309641O380517
$$ 213699585 219464482 225331518 231297077 237356754 243505483 249737686 256047327 262427844
246591B62427844O444084O499392O545381O581074O605752O619038O620829O611199
$$ 262427844 268871928 275371320 281916701 288497775 295103527 301722565 308343394 314954593
246583C14954593O590271O558220O515403O462547O400928O332368O259047O183091
$$ 314954593 321544864 328103084 334618487 341081034 347481962 353814330 360073377 366256468
246575C66256468O106094O028641N949996N867963N778963N678242N560251N419082
$$ 366256468 372362562 378391203 384341199 390209162 395988125 401666367 407226618 412645700
246567D12645700N249024N045109M803601M522248M200264L837976L436297K996221
$$ 412645700 417894724 422939833 427743434 432265682 436465946 440303922 443740219 446736440
246559D46736440K518609K004427J455425Q75107K69643l51555r75806j587685
$$ 446736440 449255049 451259476 452714901 453590008 453859651 453508096 452532290 450944605
246551D50944605k170026k705143l176239l568876l872600m082637m201501m240083
$$ 450944605 448774579 446069436 442893197 439324321 435451721 431369084 427167583 422927500
246543D22927500m217732m160862m099986m065537m083273m170338m332959m566331
$$ 422927500 418709768 414548906 410448920 406383383 402300110 398129772 393796813 389230482
246535C89230482m856637n184517n528990n870803o194516o489172o747845o966647
$$ 389230482 384373845 379189328 373660338 367789535 361595019 355105847 348358002 341391355
246527C41391355p143763p278867p372897p428073p447800p436346p398328p338121
$$ 341391355 334247592 326968725 319595828 312167755 304719955 297283609 289885281 282547160
246519B82547160p259488p165494p058707o941536o816459o686036o552698o418410
$$ 282547160 275287672 268122178 261063471 254121935 247305476 240619440 234066742 227648332
246511B27648332o284427o151253o018834n886911n755327n624226n494005n365144
$$ 227648332 221363905 215212652 209193818 203306907 197551580 191927354 186433349 181068205
246503A81068205n238008n112725m989221m867368m747151m628761m512573m398998
$$ 181068205 175830197 170717472 165728251 160860883 156113732 151484971 146972398 142573400
246495A42573400m288332m180635m075737l973318l873054l774718l678210l583519
$$ 142573400 138285068 134104433 130028696 126055378 122182324 118407606 114729396 111145877
246487A11145877l490643l399514l309998l221925l135150l049606k965297k882276
$$ 111145877 107655234 104255720 100945722 97723797 94588647 91539041 88573744 85691468
246479H5691468k800586k720234k641189k563418k486942k411834k338236k266296
$$ 85691468 82890882 80170648 77529459 74966041 72479099 70067265 67729029 65462733
246471F5462733k196132k127801k061303j996616j933717j872624j813374j756006
$$ 65462733 63266601 61138800 59077497 57080881 55147164 53274540 51461166 49705160
246463D9705160j700524j646889j595012j544782j496090j448850j402982j358431
$$ 49705160 48004636 46357747 44762735 43217953 41721863 40273013 38870031 37511600
246455C7511600j315134j273054j232172j192514j154143j117121j081487j047195
$$ 37511600 36196466 34923412 33691240 32498726 31344583 30227462 29145975 28098780
246447B8098780j014124r82086r50892r20405q90589q61508q33293q06069p79911
$$ 28098780 27084656 26102570 25151678 24231273 23340684 22479176 21645883 20839814 20059903
246438B0059903p54797p30617p07229o84488o62314o40696o19706n99445n80020
$$ 20059903 19305106 18574489 17867260 17182772 16520458 15879762 15260056 14660611 14080591
246429A4080591n61495n43871n27064n10931m95297m79996m64923m50066m35509
$$ 14080591 13519096 12975225 12448161 11937230 11441933 10961937 10497014 10046948 9611439
246420I611439m21391m07862l95000l82779l71066l59673l48429l37254l26187
$$ 9611439 9190048 8782186 8387186 8004407 7633341 7273668 6925239 6587985 6261798
246411F261798l15366l04957k95077k85740k76858k68279k59870k51571k43402
$$ 6261798 5946432 5641475 5346398 5060658 4783800 4515521 4255651 4004080 3760678
246402C760678k35446k27770k20400k13300k06396j99656j93107j86844j80976
$$ 3760678 3525232 3297462 3077062 2863762 2657366 2457710 2264603 2077759 1896783
246393A896783j75556j70519j65693j60848j55818j50570j45248j40104j35406
$$ 1896783 1721227 1550708 1385015 1224167 1068349 917779 772531 632427 497021
246384D97021j31305j27761A13396h004j18030j14330j10376j06369j02551r9098
$$ 497021 365716 237955 113396 -8004 -126034 -240364 -350740 -457109 -559660 -658758
246374f58758r6055r3350r0842q8404q5960q3506q1064p8651p6255p3844p1391
$$ -658758 -754813 -848163 -939005 -1027409 -1113369 -1196875 -1277939 -1356590 -1432845 -1506689 -1578080
246363a578080o8917o6480o4155o1988n9957n7978n5947n3799n1561m9356m7363
$$ -1578080 -1646997 -1713477 -1777632 -1839620 -1899577 -1957555 -2013502 -2067301 -2118862 -2168218 -2215581
246352b215581m5729m4503m3604m2845m2013m0952l9617l8082l6481l4951l3562
$$ -2215581 -2261310 -2305813 -2349417 -2392262 -2434275 -2475227 -2514844 -2552926 -2589407 -2624358 -2657920
246341b657920l2314l1149l0011k8873k7761k6725k5804k5003k4288k3600k2898
$$ -2657920 -2690234 -2721383 -2751394 -2780267 -2808028 -2834753 -2860557 -2885560 -2909848 -2933448 -2956346
246330b956346k2164k1408k0636j9835j8965j7986j6900j5773j4737j3943j3483
$$ -2956346 -2978510 -2999918 -3020554 -3040389 -3059354 -3077340 -3094240 -3110013 -3124750 -3138693 -3152176
246319c152176j3347j3385j3383j3129j2523j1624j0622r767r241r079r155r235
$$ -3152176 -3165523 -3178908 -3192291 -3205420 -3217943 -3229567 -3240189 -3249956 -3259197 -3268276 -3277431 -3286666
246307c286666r087q587p766o784n856n143m697m454m285m076l790l465l188l017
$$ -3286666 -3295753 -3304340 -3312106 -3318890 -3324746 -3329889 -3334586 -3339040 -3343325 -3347401 -3351191 -3354656 -3357844 -3360861
246293c360861k947k892k746k428j949j414r75p62q07j029j256j312j085n88M8
$$ -3360861 -3363808 -3366700 -3369446 -3371874 -3373823 -3375237 -3376212 -3376974 -3377781 -3378810 -3380066 -3381378 -3382463 -3383051 -3383003
246278c383003O29R81J022P91M30J25M1K61P66J460K188K804L199L321L192K884
$$ -3383003 -3382374 -3381393 -3380371 -3379580 -3379150 -3379025 -3378984 -3378723 -3377957 -3376497 -3374309 -3371505 -3368306 -3364985 -3361793 -3358909
246262c358909K502K160J951J923K066K321K596K806K892K856K741K632K600K697
$$ -3358909 -3356407 -3354247 -3352296 -3350373 -3348307 -3345986 -3343390 -3340584 -3337692 -3334836 -3332095 -3329463 -3326863 -3324166
246248c324166K920L224L541L801L955L984L907L771L632L543L555L675L883M119
$$ -3324166 -3321246 -3318022 -3314481 -3310680 -3306725 -3302741 -3298834 -3295063 -3291431 -3287888 -3284333 -3280658 -3276775 -3272656
246234c272656M298M334M176L836L388K965K703K699K960L411L902M281M438M357
$$ -3272656 -3268358 -3264024 -3259848 -3256012 -3252624 -3249659 -3246956 -3244257 -3241297 -3237886 -3233984 -3229703 -3225265 -3220908
246220c220908M103L806L588L530L634L850M095M306M455M553M624M687M731M730
$$ -3220908 -3216805 -3212999 -3209411 -3205881 -3202247 -3198397 -3194302 -3189996 -3185541 -3180988 -3176364 -3171677 -3166946 -3162216
246206c162216M664M546M431M394M504M776N155N531N773N788N568N182M764M453
$$ -3162216 -3157552 -3153006 -3148575 -3144181 -3139677 -3134901 -3129746 -3124215 -3118442 -3112654 -3107086 -3101904 -3097140 -3092687
246192c092687M329M396M580M760M839M766M567M314M107M018M078M270M548M860
$$ -3092687 -3088358 -3083962 -3079382 -3074622 -3069783 -3065017 -3060450 -3056136 -3052029 -3048011 -3043933 -3039663 -3035115 -3030255
246178c030255N161N419N614N723N719N591N343N013M664M371M196M162M256M423
$$ -3030255 -3025094 -3019675 -3014061 -3008338 -3002619 -2997028 -2991685 -2986672 -2982008 -2977637 -2973441 -2969279 -2965023 -2960600
246164b960600M611M771M893M983N063N147N226N278N280N234N155N089N064N093
$$ -2960600 -2955989 -2951218 -2946325 -2941342 -2936279 -2931132 -2925906 -2920628 -2915348 -2910114 -2904959 -2899870 -2894806 -2889713
246150b889713N143N160N084M895M628M362M205M226M450M820N228N566N752N769
$$ -2889713 -2884570 -2879410 -2874326 -2869431 -2864803 -2860441 -2856236 -2852010 -2847560 -2842740 -2837512 -2831946 -2826194 -2820425
246136b820425N654N471N270N073M869M644M419M253M232M429M844N387N881O137
$$ -2820425 -2814771 -2809300 -2804030 -2798957 -2794088 -2789444 -2785025 -2780772 -2776540 -2772111 -2767267 -2761880 -2755999 -2749862
246122b749862O019N516M749L946L330L064L162L522L971M347M567M644M644M637
$$ -2749862 -2743843 -2738327 -2733578 -2729632 -2726302 -2723238 -2720076 -2716554 -2712583 -2708236 -2703669 -2699025 -2694381 -2689744
246108b689744M631M576M391M041L576L146K942L101L638M399N131N565N547N100
$$ -2689744 -2685113 -2680537 -2676146 -2672105 -2668529 -2665383 -2662441 -2659340 -2655702 -2651303 -2646172 -2640607 -2635060 -2629960
246094b629960M411L757L372L351L624M005M285M341M191L953L780L768L905M083
$$ -2629960 -2625549 -2621792 -2618420 -2615069 -2611445 -2607440 -2603155 -2598814 -2594623 -2590670 -2586890 -2583122 -2579217 -2575134
246080b575134M175M119L948L795L797M031M432M832N027M881M415L793L264L041
$$ -2575134 -2570959 -2566840 -2562892 -2559097 -2555300 -2551269 -2546837 -2542005 -2536978 -2532097 -2527682 -2523889 -2520625 -2517584
246066b517584L198L641M158M510M561M315L922L575L428L510L745L997M162M217
$$ -2517584 -2514386 -2510745 -2506587 -2502077 -2497516 -2493201 -2489279 -2485704 -2482276 -2478766 -2475021 -2471024 -2466862 -2462645
246052b462645M228M290M448M650M761M622M163L442K669K119K011K419L226M172
$$ -2462645 -2458417 -2454127 -2449679 -2445029 -2440268 -2435646 -2431483 -2428041 -2425372 -2423253 -2421242 -2418823 -2415597 -2411425
246038b411425M962N391N400N093M661M282M045L938L873L770L610L442L363L449
$$ -2411425 -2406463 -2401072 -2395672 -2390579 -2385918 -2381636 -2377591 -2373653 -2369780 -2366010 -2362400 -2358958 -2355595 -2352146
246024b352146L699M034M319M439M335M054L696L381L186L120L137L175L194L201
$$ -2352146 -2348447 -2344413 -2340094 -2335655 -2331320 -2327266 -2323570 -2320189 -2317003 -2313883 -2310746 -2307571 -2304377 -2301176
246010b301176L229L315L457L617L726L737L644L489L344L255L222L189L079K842
$$ -2301176 -2297947 -2294632 -2291175 -2287558 -2283832 -2280095 -2276451 -2272962 -2269618 -2266363 -2263141 -2259952 -2256873 -2254031
245996b254031K503K164J955J985K265K700L118L353L311L032K656K365K287K435
$$ -2254031 -2251528 -2249364 -2247409 -2245424 -2243159 -2240459 -2237341 -2233988 -2230677 -2227645 -2224989 -2222624 -2220337 -2217902
245982b217902K699K902K895K630K198J783J581J702K113K655L109L297L153K760
$$ -2217902 -2215203 -2212301 -2209406 -2206776 -2204578 -2202795 -2201214 -2199512 -2197399 -2194744 -2191635 -2188338 -2185185 -2182425
245968b182425K292J941J825J951K215K477K616K599K478K354K320K406K571K722
$$ -2182425 -2180133 -2178192 -2176367 -2174416 -2172201 -2169724 -2167108 -2164509 -2162031 -2159677 -2157357 -2154951 -2152380 -2149658
245954b149658K773K690K512K332K254K338K575K886L169L330L332L195K975K735
$$ -2149658 -2146885 -2144195 -2141683 -2139351 -2137097 -2134759 -2132184 -2129298 -2126129 -2122799 -2119467 -2116272 -2113297 -2110562
245940b110562K513K318K149K010J936J976K167K500K898L226L355L203K807K302
$$ -2110562 -2108049 -2105731 -2103582 -2101572 -2099636 -2097660 -2095493 -2092993 -2090095 -2086869 -2083514 -2080311 -2077504 -2075202
245926b075202J899J781K036K599L281L838M077L933L501K977K582K443K545K760
$$ -2075202 -2073303 -2071522 -2069486 -2066887 -2063606 -2059768 -2055691 -2051758 -2048257 -2045280 -2042698 -2040255 -2037710 -2034950
245912b034950K887K795K468K034J701J658J969K550L178L606L659L320K726K119
$$ -2034950 -2032063 -2029268 -2026800 -2024766 -2023065 -2021407 -2019438 -2016888 -2013710 -2010104 -2006445 -2003125 -2000399 -1998280
245898a998280J717J644J864K230K548K677K588K361K139K043K116K306K494K556
$$ -1998280 -1996563 -1994919 -1993055 -1990825 -1988277 -1985600 -1983012 -1980651 -1978512 -1976469 -1974353 -1972047 -1969553 -1966997
245884a966997K426K134J781J505J417J562J905K350K781L088L209L129K878K523
$$ -1966997 -1964571 -1962437 -1960656 -1959151 -1957734 -1956172 -1954267 -1951917 -1949136 -1946048 -1942839 -1939710 -1936832 -1934309
245870a934309K151J848J681J675J809K008K180K239K147J935J685J508J485J634
$$ -1934309 -1932158 -1930310 -1928629 -1926954 -1925145 -1923137 -1920957 -1918718 -1916571 -1914636 -1912951 -1911443 -1909958 -1908324
245856a908324J904K201K427K527K511K428K345K295K261K201K069J861J632J468
$$ -1908324 -1906420 -1904219 -1901792 -1899265 -1896754 -1894326 -1891981 -1889686 -1887425 -1885224 -1883155 -1881294 -1879662 -1878194
245842a878194J449J593J858K130K306K332K245K141K140K294K570K841K961K832
$$ -1878194 -1876745 -1875152 -1873294 -1871164 -1868858 -1866526 -1864281 -1862140 -1860000 -1857706 -1855136 -1852295 -1849334 -1846502
245828a846502K470K002J621J482J638K008K416K681K707K522K259K085K111K335
$$ -1846502 -1844032 -1842030 -1840409 -1838927 -1837289 -1835281 -1832865 -1830184 -1827477 -1824955 -1822696 -1820611 -1818500 -1816165
245814a816165K645K885K942K791K531K302K226K338K563K776K855K766K568K385
$$ -1816165 -1813520 -1810635 -1807693 -1804902 -1802371 -1800069 -1797843 -1795505 -1792942 -1790166 -1787311 -1784545 -1781977 -1779592
245800a779592K325K421K610K758K743K521K160J804J607J651J899K216K443K470
$$ -1779592 -1777267 -1774846 -1772236 -1769478 -1766735 -1764214 -1762054 -1760250 -1758643 -1756992 -1755093 -1752877 -1750434 -1747964
245786a747964K298K033J834J821K022K359K683K861K830K625K346K116J994J976
$$ -1747964 -1745666 -1743633 -1741799 -1739978 -1737956 -1735597 -1732914 -1730053 -1727223 -1724598 -1722252 -1720136 -1718142 -1716166
245772a716166K005K010J965J897J865J913K030K136K129J930J542J072O84N41
$$ -1716166 -1714161 -1712151 -1710186 -1708289 -1706424 -1704511 -1702481 -1700345 -1698216 -1696286 -1694744 -1693672 -1692988 -1692447
245758a692447P11J153J711K195K451K433K202J900J668J591J663J811J932J955
$$ -1692447 -1691736 -1690583 -1688872 -1686677 -1684226 -1681793 -1679591 -1677691 -1676023 -1674432 -1672769 -1670958 -1669026 -1667071
245744a667071J863J694J506J354J258J215J217J269J382J572J811K036K142K038
$$ -1667071 -1665208 -1663514 -1662008 -1660654 -1659396 -1658181 -1656964 -1655695 -1654313 -1652741 -1650930 -1648894 -1646752 -1644714
245730a644714J694J179O48L00K86O46J272J936K382K431K048J381O89K55K60
$$ -1644714 -1643020 -1641841 -1641193 -1640893 -1640607 -1639961 -1638689 -1636753 -1634371 -1631940 -1629892 -1628511 -1627822 -1627567 -1627307
245715a627307P15J457K213K706K771K402J757J082O07M65O35R83J308J454J362
$$ -1627307 -1626592 -1625135 -1622922 -1620216 -1617445 -1615043 -1613286 -1612204 -1611597 -1611132 -1610497 -1609514 -1608206 -1606752 -1605390
245700a605390J101Q22O99Q24J186J648K021K136J921J437Q57L91K09L64P78J277
$$ -1605390 -1604289 -1603467 -1602768 -1601944 -1600758 -1599110 -1597089 -1594953 -1593032 -1591595 -1590738 -1590347 -1590138 -1589774 -1588996 -1587719
245684a587719J664J801J662J340R95P84P98J022J356J652J796J740J519J238
$$ -1587719 -1586055 -1584254 -1582592 -1581252 -1580257 -1579473 -1578675 -1577653 -1576297 -1574645 -1572849 -1571109 -1569590 -1568352
245670a568352J016R40J036J265J540J765J867J808J602J285R28N94L48K32K70
$$ -1568352 -1567336 -1566396 -1565360 -1564095 -1562555 -1560790 -1558923 -1557115 -1555513 -1554228 -1553300 -1552706 -1552358 -1552126 -1551856
245655a551856M53P44J080J390J610J687J614J411J125Q27N81M37M24N28P16R19
$$ -1551856 -1551403 -1550659 -1549579 -1548189 -1546579 -1544892 -1543278 -1541867 -1540742 -1539915 -1539334 -1538897 -1538473 -1537945 -1537229 -1536310
245639a536310J068J106J008Q01N47L34K37K95M88P51R97J154J198J154J082J047
$$ -1536310 -1535242 -1534136 -1533128 -1532327 -1531780 -1531446 -1531209 -1530914 -1530426 -1529675 -1528678 -1527524 -1526326 -1525172 -1524090 -1523043
245623a523043J080J165J246J260J159R49O77M10K20J42J83L22N35P99J095J390
$$ -1523043 -1521963 -1520798 -1519552 -1518292 -1517133 -1516184 -1515507 -1515097 -1514877 -1514735 -1514552 -1514230 -1513695 -1512896 -1511801 -1510411
245607a510411J640J778J748J533J181P95N04M04N10P40R53R98Q13M44L5k27k07
$$ -1510411 -1508771 -1506993 -1505245 -1503712 -1502531 -1501736 -1501232 -1500828 -1500318 -1499578 -1498625 -1497627 -1496814 -1496370 -1496335 -1496562 -1496769
245590a496769J01N85J046J303J281J040P48O02P12J060J497J819J863J591J105
$$ -1496769 -1496668 -1496083 -1495037 -1493734 -1492453 -1491413 -1490665 -1490063 -1489351 -1488291 -1486794 -1484975 -1483112 -1481521 -1480416
245575a480416O03K79K49N05R31J372J707J881J918J866J763J612J403J140R01
$$ -1480416 -1479813 -1479534 -1479285 -1478780 -1477849 -1476477 -1474770 -1472889 -1470971 -1469105 -1467342 -1465730 -1464327 -1463187 -1462286
245560a462286P99R64J450K189K987L577L742L407K693J878J285J153J535K268
$$ -1462286 -1461487 -1460523 -1459073 -1456884 -1453897 -1450320 -1446578 -1443171 -1440478 -1438600 -1437315 -1436162 -1434627 -1432359
245546a432359L067L627L764L471K909K314J892J734J811J999K179K279K317K361
$$ -1432359 -1429292 -1425665 -1421901 -1418430 -1415521 -1413207 -1411315 -1409581 -1407770 -1405771 -1403592 -1401313 -1398996 -1396635
245532a396635K486K711K991L227L329L241K985K638K297K054J951J991K142K348
$$ -1396635 -1394149 -1391438 -1388447 -1385220 -1381891 -1378650 -1375665 -1373027 -1370730 -1368676 -1366725 -1364734 -1362592 -1360244
245518a360244K553K689K701K548K229J808J399J145J158J464J970K488K799K754
$$ -1360244 -1357691 -1355002 -1352301 -1349753 -1347524 -1345716 -1344317 -1343172 -1342014 -1340550 -1338580 -1336092 -1333293 -1330539
245504a330539K330J674J029O40O48J023J575K044K214K012J533R95O27N67Q06
$$ -1330539 -1328209 -1326535 -1325506 -1324866 -1324218 -1323195 -1321620 -1319576 -1317362 -1315350 -1313817 -1312822 -1312195 -1311628 -1310822
245489a310822J196J539J683J596J369J167J142J350J727K125K380K391K151J756
$$ -1310822 -1309626 -1308087 -1306404 -1304808 -1303439 -1302272 -1301130 -1299780 -1298053 -1295928 -1293548 -1291157 -1289006 -1287250
245475a287250J337J012Q37P96Q37R02R65J032J124J258J416J561J651J661J596
$$ -1287250 -1285913 -1284901 -1284064 -1283268 -1282431 -1281529 -1280564 -1279532 -1278408 -1277150 -1275734 -1274173 -1272522 -1270861 -1269265
245460a269265J494J387J314J274J264J280J326J428J590J798J994K094K024J765
$$ -1269265 -1267771 -1266384 -1265070 -1263796 -1262532 -1261252 -1259926 -1258498 -1256908 -1255110 -1253116 -1251022 -1248998 -1247233
245446a247233J374R71O97O49Q28J139J421J532J412J121Q14O72Q10J212J737
$$ -1247233 -1245859 -1244888 -1244191 -1243542 -1242714 -1241575 -1240154 -1238622 -1237210 -1236089 -1235275 -1234603 -1233793 -1232581 -1230844
245431a230844K165K298K054J497Q24K81N2J99O27J138J514J601J369R15M09L0
$$ -1230844 -1228679 -1226381 -1224327 -1222830 -1222006 -1221725 -1221673 -1221474 -1220847 -1219709 -1218195 -1216594 -1215225 -1214310 -1213901 -1213871
245415a213871j04L4L86Q33J254J554J684J648J485J251J006Q02O66O04N99O18
$$ -1213871 -1213975 -1213941 -1213555 -1212722 -1211468 -1209914 -1208230 -1206582 -1205097 -1203846 -1202840 -1202038 -1201372 -1200768 -1200169 -1199551
245399a199551O35O32O20O20O58P39Q32Q82Q31O49L65O5j36j33J06N38J033J449
$$ -1199551 -1198916 -1198284 -1197664 -1197044 -1196386 -1195647 -1194815 -1193933 -1193102 -1192453 -1192088 -1192023 -1192159 -1192292 -1192186 -1191648 -1190615 -1189166
245381a189166J673J682J541J370J277J306J415J490J423J165P68L74J42J83M87
$$ -1189166 -1187493 -1185811 -1184270 -1182900 -1181623 -1180317 -1178902 -1177412 -1175989 -1174824 -1174056 -1173682 -1173540 -1173357 -1172870
245366a172870R31J322J496J375J033O28L55L25N42Q82J175J289J196R97Q50R02
$$ -1172870 -1171939 -1170617 -1169121 -1167746 -1166713 -1166085 -1165730 -1165405 -1164863 -1163981 -1162806 -1161517 -1160321 -1159324 -1158474 -1157572
$$ [...]
##END NTUPLES=NMR SPECTRUM
##END=
